program: Orca
programVersion: 5.0.4
elementType: S S P O O C C C C C C C C H H H H H H H H H H H H H H H H H H H
charge: 0
multiplicity: 1
keywords: wb97x-d3
keywords: def2-TZVPP
keywords: def2/J RIJCOSX
keywords: DEFGRID2
keywords: scfconv7
keywords: smallprint printgap noloewdin
keywords: NOSOSCF
formula: C8H19O2PS2
InChI: InChI=1/C8H19O2PS2/c1-4-7-12-11(9,10-6-3)13-8-5-2/h4-8H2,1-3H3
32 atoms
S  1.932357 -0.740977 0.675249
S  -0.590167 1.384322 0.608192
P  0.105396 -0.371634 -0.240526
O  -0.831024 -1.485666 0.428193
O  0.147224 -0.357985 -1.729832
C  3.082668 0.067039 -0.504534
C  -1.860668 1.880572 -0.620117
C  3.02174 1.583263 -0.529864
C  -3.093923 0.997291 -0.662696
C  3.325264 2.237546 0.805736
C  -3.823589 0.883689 0.66394
C  -0.762193 -2.860174 -0.024828
C  -1.803859 -3.141496 -1.078085
H  2.905646 -0.359561 -1.490189
H  4.065374 -0.274629 -0.1751
H  -1.380937 1.95304 -1.59491
H  -2.123178 2.894593 -0.312585
H  3.753704 1.908252 -1.274225
H  2.049028 1.912929 -0.900824
H  -3.758989 1.436396 -1.411402
H  -2.834994 0.005709 -1.040206
H  2.58213 1.977447 1.560332
H  3.330811 3.323614 0.713251
H  4.302993 1.931898 1.182389
H  -3.220367 0.372229 1.41445
H  -4.749744 0.320753 0.547837
H  -4.081566 1.868141 1.058528
H  -0.931382 -3.464257 0.864942
H  0.241119 -3.090884 -0.391149
H  -1.766203 -4.199604 -1.339608
H  -2.808204 -2.924288 -0.713995
H  -1.627562 -2.567068 -1.986876
elementType: S P O C H
totalener: -1604.68156435 hartree
nucrepener: 1306.98929939 hartree
electener: -2911.67086374 hartree
oneelecener: -4808.53980180 hartree
twoeener: 1896.86893806 hartree
cpcmener: -0.02290391 hartree
kineticenergy: 1600.32616065 hartree
xcener: -101.620593441767 hartree
chargesum: -0.0000000
charge: -0.189439 -0.175770 0.739643 -0.368116 -0.652325 -0.102407 -0.104552 -0.109339 -0.091128 -0.257412 -0.262019 0.051855 -0.262328 0.125941 0.128023 0.123552 0.129712 0.086082 0.061494 0.084573 0.055329 0.067706 0.095848 0.089645 0.073081 0.094684 0.088081 0.109100 0.090848 0.105555 0.090564 0.083518
qa: -0.1894 -0.1758 0.7396 -0.3681 -0.6523 -0.1024 -0.1046 -0.1093 -0.0911 -0.2574 -0.2620 0.0519 -0.2623 0.1259 0.1280 0.1236 0.1297 0.0861 0.0615 0.0846 0.0553 0.0677 0.0958 0.0896 0.0731 0.0947 0.0881 0.1091 0.0908 0.1056 0.0906 0.0835
va: 2.2941 2.2766 5.3595 2.0630 1.9180 3.8669 3.8820 3.8833 3.8788 3.9311 3.9343 3.8498 3.9293 1.0259 1.0022 1.0257 1.0023 1.0091 1.0218 1.0104 1.0203 1.0128 1.0045 1.0021 1.0145 1.0049 1.0009 0.9922 1.0085 1.0093 1.0013 1.0175
dispcorr: -0.014691596 hartree
energy: -1604.696255945911
dipole: -6.25784 6.17671 -0.08113 2.95243 -3.02214 -0.06971 -3.69570 3.79339 0.09769
magnitude: 0.14486 au
magnitude: 0.36821 debye
