program: Orca
programVersion: 5.0.4
elementType: S S P O O C C C C C C C C H H H H H H H H H H H H H H H H H H H
charge: 0
multiplicity: 1
keywords: wb97x-d3
keywords: def2-TZVPP
keywords: def2/J RIJCOSX
keywords: DEFGRID2
keywords: scfconv7
keywords: smallprint printgap noloewdin
keywords: NOSOSCF
formula: C8H19O2PS2
InChI: InChI=1/C8H19O2PS2/c1-4-7-12-11(9,10-6-3)13-8-5-2/h4-8H2,1-3H3
32 atoms
S  2.086146 -0.688661 -0.06601
S  -0.791886 0.2634 1.096595
P  0.090157 -0.496601 -0.621452
O  -0.420009 -1.999287 -0.804644
O  -0.158522 0.285804 -1.860177
C  2.784881 0.846997 -0.790351
C  -2.51332 0.543456 0.504295
C  2.33833 2.138471 -0.132194
C  -2.869355 2.019627 0.48208
C  2.678052 2.235607 1.343853
C  -2.045812 2.854194 -0.483031
C  -0.39115 -2.97615 0.257335
C  -1.794203 -3.326331 0.678891
H  2.573862 0.842785 -1.858094
H  3.86106 0.706852 -0.672567
H  -3.159578 -0.003336 1.189798
H  -2.635544 0.093063 -0.481391
H  2.834005 2.946063 -0.677917
H  1.267482 2.288191 -0.285115
H  -3.926761 2.081843 0.210606
H  -2.790566 2.427774 1.492268
H  2.392636 3.209634 1.741144
H  3.748755 2.109197 1.512145
H  2.157031 1.477607 1.929545
H  -2.377438 3.892342 -0.4684
H  -2.139532 2.491334 -1.507386
H  -0.987247 2.847575 -0.219572
H  0.182986 -2.610437 1.112652
H  0.133415 -3.84419 -0.139774
H  -2.306645 -2.469419 1.116687
H  -2.383947 -3.694753 -0.160298
H  -1.754272 -4.11366 1.431946
elementType: S P O C H
totalener: -1604.67922793 hartree
nucrepener: 1314.32741560 hartree
electener: -2919.00664352 hartree
oneelecener: -4822.95628289 hartree
twoeener: 1903.94963936 hartree
cpcmener: -0.02742322 hartree
kineticenergy: 1600.33104714 hartree
xcener: -101.623996400581 hartree
chargesum: -0.0000000
charge: -0.203534 -0.189739 0.747025 -0.365656 -0.649642 -0.095275 -0.089148 -0.093571 -0.088251 -0.256159 -0.269660 0.041197 -0.239313 0.127155 0.128874 0.128493 0.108679 0.087035 0.046289 0.076529 0.070269 0.096239 0.090202 0.067141 0.100299 0.081447 0.072940 0.085012 0.113656 0.077673 0.094878 0.098915
qa: -0.2035 -0.1897 0.7470 -0.3657 -0.6496 -0.0953 -0.0891 -0.0936 -0.0883 -0.2562 -0.2697 0.0412 -0.2393 0.1272 0.1289 0.1285 0.1087 0.0870 0.0463 0.0765 0.0703 0.0962 0.0902 0.0671 0.1003 0.0814 0.0729 0.0850 0.1137 0.0777 0.0949 0.0989
va: 2.2692 2.2675 5.3981 2.0873 1.9417 3.8732 3.8785 3.8908 3.9062 3.9305 3.9389 3.8527 3.9342 1.0240 1.0011 1.0051 1.0256 1.0128 1.0147 1.0093 1.0100 1.0043 1.0022 1.0125 1.0095 1.0064 0.9960 1.0019 0.9967 1.0085 1.0043 1.0082
dispcorr: -0.015122007 hartree
energy: -1604.694349936319
dipole: -5.66011 5.40362 -0.25650 10.00167 -10.32892 -0.32725 5.50926 -3.87794 1.63132
magnitude: 1.68347 au
magnitude: 4.27905 debye
