program: Orca
programVersion: 5.0.4
elementType: S S P O O C C C C C C C C H H H H H H H H H H H H H H H H H H H
charge: 0
multiplicity: 1
keywords: wb97x-d3
keywords: def2-TZVPP
keywords: def2/J RIJCOSX
keywords: DEFGRID2
keywords: scfconv7
keywords: smallprint printgap noloewdin
keywords: NOSOSCF
formula: C8H19O2PS2
InChI: InChI=1/C8H19O2PS2/c1-4-7-12-11(9,10-6-3)13-8-5-2/h4-8H2,1-3H3
32 atoms
S  1.85765 -0.918837 0.450759
S  -0.52882 1.320404 0.890617
P  -0.064325 -0.41722 -0.156366
O  -0.918865 -1.549314 0.58573
O  -0.251131 -0.312438 -1.630283
C  2.86463 0.044641 -0.742724
C  -1.595927 2.241051 -0.286011
C  2.814877 1.553394 -0.589163
C  -3.083512 1.985512 -0.139663
C  3.236477 2.053036 0.780059
C  -3.527566 0.577807 -0.494505
C  -1.402831 -2.716976 -0.120078
C  -0.306776 -3.681542 -0.499824
H  2.579664 -0.264423 -1.7472
H  3.876508 -0.324623 -0.566538
H  -1.245943 2.039863 -1.297904
H  -1.366386 3.285042 -0.071327
H  3.484387 1.959827 -1.35217
H  1.818351 1.924249 -0.836253
H  -3.399869 2.234303 0.875493
H  -3.582607 2.701365 -0.799132
H  3.245954 3.142719 0.807854
H  4.239074 1.70587 1.035919
H  2.555695 1.711069 1.559892
H  -3.184073 0.287626 -1.488528
H  -4.615304 0.506875 -0.487767
H  -3.15567 -0.155085 0.221324
H  -1.968763 -2.399742 -0.997203
H  -2.101033 -3.181472 0.573531
H  0.278814 -3.988365 0.366322
H  -0.765188 -4.574385 -0.926185
H  0.367576 -3.268532 -1.249628
elementType: S P O C H
totalener: -1604.67813518 hartree
nucrepener: 1314.63320189 hartree
electener: -2919.31133707 hartree
oneelecener: -4823.84253932 hartree
twoeener: 1904.53120225 hartree
cpcmener: -0.02191063 hartree
kineticenergy: 1600.33225627 hartree
xcener: -101.623273261054 hartree
chargesum: -0.0000000
charge: -0.184958 -0.183499 0.759289 -0.380150 -0.649899 -0.108979 -0.096776 -0.103640 -0.078954 -0.264439 -0.276375 0.041400 -0.260413 0.124868 0.128542 0.113549 0.129875 0.087268 0.060168 0.064267 0.074921 0.096099 0.090616 0.068416 0.082136 0.100136 0.073339 0.101710 0.112566 0.090769 0.103394 0.084754
qa: -0.1850 -0.1835 0.7593 -0.3801 -0.6499 -0.1090 -0.0968 -0.1036 -0.0790 -0.2644 -0.2764 0.0414 -0.2604 0.1249 0.1285 0.1135 0.1299 0.0873 0.0602 0.0643 0.0749 0.0961 0.0906 0.0684 0.0821 0.1001 0.0733 0.1017 0.1126 0.0908 0.1034 0.0848
va: 2.2962 2.2789 5.3357 2.0549 1.9167 3.8791 3.8671 3.8809 3.8896 3.9303 3.9319 3.8360 3.9320 1.0229 1.0012 1.0306 1.0028 1.0089 1.0187 1.0125 1.0086 1.0041 1.0022 1.0144 1.0087 1.0079 1.0125 0.9983 0.9884 1.0040 1.0093 1.0141
dispcorr: -0.015266418 hartree
energy: -1604.693401597685
dipole: -3.23744 3.15883 -0.07861 3.59197 -3.35243 0.23954 -5.19466 5.12498 -0.06968
magnitude: 0.26156 au
magnitude: 0.66482 debye
