program: Orca
programVersion: 5.0.4
elementType: S S P O O C C C C C C C C H H H H H H H H H H H H H H H H H H H
charge: 0
multiplicity: 1
keywords: wb97x-d3
keywords: def2-TZVPP
keywords: def2/J RIJCOSX
keywords: DEFGRID2
keywords: scfconv7
keywords: smallprint printgap noloewdin
keywords: NOSOSCF
formula: C8H19O2PS2
InChI: InChI=1/C8H19O2PS2/c1-4-7-12-11(9,10-6-3)13-8-5-2/h4-8H2,1-3H3
32 atoms
S  1.951626 -0.995429 -0.262553
S  -0.577025 0.870701 0.738469
P  0.078684 -0.316356 -0.84596
O  -0.790239 -1.655853 -0.884569
O  0.05293 0.373521 -2.164513
C  3.025383 0.372266 -0.849504
C  -1.793269 1.945924 -0.11651
C  2.931733 1.666503 -0.063218
C  -3.106505 1.274354 -0.468788
C  3.226746 1.517548 1.417825
C  -3.92573 0.854316 0.738703
C  -1.449135 -2.303705 0.22031
C  -0.490018 -2.965174 1.177772
H  2.82454 0.529093 -1.90789
H  4.027633 -0.052549 -0.770378
H  -1.30501 2.369461 -0.992308
H  -1.952845 2.763856 0.588813
H  3.654189 2.351427 -0.51543
H  1.951291 2.123437 -0.208343
H  -3.676807 1.996075 -1.060157
H  -2.927584 0.421418 -1.127665
H  4.208893 1.07158 1.584275
H  2.487586 0.888872 1.915222
H  3.216478 2.488492 1.913354
H  -3.398407 0.127178 1.357561
H  -4.86676 0.399276 0.429989
H  -4.164299 1.713044 1.368392
H  -2.097159 -3.043618 -0.245695
H  -2.084785 -1.584036 0.738386
H  0.175437 -3.660197 0.666027
H  0.112158 -2.243208 1.730421
H  -1.066256 -3.532991 1.908829
elementType: S P O C H
totalener: -1604.67879304 hartree
nucrepener: 1315.97358871 hartree
electener: -2920.65238175 hartree
oneelecener: -4826.07009030 hartree
twoeener: 1905.41770855 hartree
cpcmener: -0.02698417 hartree
kineticenergy: 1600.32502303 hartree
xcener: -101.625321935888 hartree
chargesum: -0.0000000
charge: -0.190264 -0.198834 0.736534 -0.365417 -0.655811 -0.100687 -0.081438 -0.115935 -0.112666 -0.258122 -0.261476 0.036319 -0.249526 0.126026 0.129639 0.123111 0.126482 0.087522 0.065599 0.084322 0.068356 0.090754 0.068202 0.095715 0.076242 0.095884 0.090280 0.112959 0.098931 0.100257 0.071724 0.105318
qa: -0.1903 -0.1988 0.7365 -0.3654 -0.6558 -0.1007 -0.0814 -0.1159 -0.1127 -0.2581 -0.2615 0.0363 -0.2495 0.1260 0.1296 0.1231 0.1265 0.0875 0.0656 0.0843 0.0684 0.0908 0.0682 0.0957 0.0762 0.0959 0.0903 0.1130 0.0989 0.1003 0.0717 0.1053
va: 2.2851 2.2600 5.3813 2.0760 1.9423 3.8769 3.8539 3.8759 3.8950 3.9274 3.9328 3.8651 3.9015 1.0254 1.0002 1.0282 1.0039 1.0095 1.0205 1.0092 1.0203 1.0019 1.0122 1.0045 1.0036 1.0046 1.0014 0.9924 0.9881 1.0028 1.0140 1.0115
dispcorr: -0.015055810 hartree
energy: -1604.693848852162
dipole: -5.45445 4.99684 -0.45761 5.13107 -4.95960 0.17147 9.53926 -7.81417 1.72509
magnitude: 1.79297 au
magnitude: 4.55737 debye
