program: Orca
programVersion: 5.0.4
elementType: S S P O O C C C C C C C C H H H H H H H H H H H H H H H H H H H
charge: 0
multiplicity: 1
keywords: wb97x-d3
keywords: def2-TZVPP
keywords: def2/J RIJCOSX
keywords: DEFGRID2
keywords: scfconv7
keywords: smallprint printgap noloewdin
keywords: NOSOSCF
formula: C8H19O2PS2
InChI: InChI=1/C8H19O2PS2/c1-4-7-12-11(9,10-6-3)13-8-5-2/h4-8H2,1-3H3
32 atoms
S  1.640974 -0.13071 0.864824
S  -1.668473 -0.131192 0.393884
P  0.125517 -0.855515 -0.35868
O  0.061974 -2.391981 0.076889
O  0.333932 -0.584735 -1.807731
C  2.82301 0.524312 -0.376547
C  -1.54572 1.60184 -0.188382
C  2.474438 1.908228 -0.891021
C  -2.775922 2.370082 0.267766
C  2.493327 2.983637 0.180061
C  -2.705867 3.819487 -0.188615
C  -0.933084 -3.281197 -0.490872
C  -0.360782 -4.673013 -0.536061
H  2.921007 -0.199181 -1.18327
H  3.775175 0.538393 0.157397
H  -1.4709 1.602277 -1.275102
H  -0.638458 2.045449 0.22681
H  3.209627 2.150501 -1.66368
H  1.504129 1.886655 -1.390131
H  -3.674683 1.898767 -0.135658
H  -2.856135 2.32834 1.3562
H  2.277238 3.96191 -0.24955
H  3.470471 3.04303 0.662546
H  1.750028 2.796448 0.956472
H  -1.836825 4.327079 0.232196
H  -3.594381 4.366966 0.126244
H  -2.640689 3.891354 -1.275051
H  -1.211147 -2.947694 -1.492461
H  -1.823026 -3.245639 0.139249
H  -0.079005 -5.024263 0.456299
H  -1.116038 -5.353694 -0.928038
H  0.51012 -4.726232 -1.188407
elementType: S P O C H
totalener: -1604.68103963 hartree
nucrepener: 1271.81709077 hartree
electener: -2876.49813040 hartree
oneelecener: -4737.83105862 hartree
twoeener: 1861.33292821 hartree
cpcmener: -0.02423140 hartree
kineticenergy: 1600.32180880 hartree
xcener: -101.617082940569 hartree
chargesum: 0.0000000
charge: -0.184131 -0.187085 0.752377 -0.370070 -0.650696 -0.078101 -0.084822 -0.126129 -0.084356 -0.257520 -0.276652 0.028331 -0.246367 0.120588 0.126882 0.117568 0.100147 0.085526 0.064850 0.075450 0.073335 0.095157 0.091168 0.071426 0.084958 0.094583 0.084176 0.106761 0.105299 0.089088 0.090054 0.088205
qa: -0.1841 -0.1871 0.7524 -0.3701 -0.6507 -0.0781 -0.0848 -0.1261 -0.0844 -0.2575 -0.2767 0.0283 -0.2464 0.1206 0.1269 0.1176 0.1001 0.0855 0.0648 0.0755 0.0733 0.0952 0.0912 0.0714 0.0850 0.0946 0.0842 0.1068 0.1053 0.0891 0.0901 0.0882
va: 2.2706 2.3066 5.3761 2.1114 1.9303 3.8321 3.9232 3.9079 3.8989 3.9168 3.9556 3.8600 3.9760 1.0302 1.0063 1.0169 1.0044 1.0101 1.0174 1.0120 1.0104 1.0046 1.0018 1.0109 1.0002 1.0042 1.0008 0.9935 0.9894 1.0028 1.0057 1.0063
dispcorr: -0.013081000 hartree
energy: -1604.694120631302
dipole: -1.63466 1.37298 -0.26167 13.66040 -13.08421 0.57618 -3.60014 3.94526 0.34511
magnitude: 0.72081 au
magnitude: 1.83215 debye
