program: Orca
programVersion: 5.0.4
elementType: S S P O O C C C C C C C C H H H H H H H H H H H H H H H H H H H
charge: 0
multiplicity: 1
keywords: wb97x-d3
keywords: def2-TZVPP
keywords: def2/J RIJCOSX
keywords: DEFGRID2
keywords: scfconv7
keywords: smallprint printgap noloewdin
keywords: NOSOSCF
formula: C8H19O2PS2
InChI: InChI=1/C8H19O2PS2/c1-4-7-12-11(9,10-6-3)13-8-5-2/h4-8H2,1-3H3
32 atoms
S  1.97718 -0.233812 0.974984
S  -1.093573 1.015892 0.973408
P  0.166635 -0.315591 -0.027023
O  -0.22568 -1.786324 0.458332
O  0.183519 -0.068783 -1.496199
C  2.520955 1.448435 0.490609
C  -1.95305 1.857932 -0.409473
C  3.210516 1.521313 -0.858927
C  -3.060648 1.051736 -1.060144
C  4.486381 0.701091 -0.936855
C  -4.188769 0.676202 -0.115719
C  -1.486032 -2.392227 0.09612
C  -1.411053 -3.097434 -1.235449
H  3.202289 1.74764 1.289156
H  1.659828 2.116711 0.545657
H  -1.20507 2.177794 -1.132447
H  -2.356031 2.759429 0.056609
H  2.519483 1.225396 -1.649034
H  3.442022 2.575675 -1.03464
H  -3.454611 1.664843 -1.875616
H  -2.643602 0.157362 -1.528851
H  4.290486 -0.36453 -0.809539
H  5.197453 1.00333 -0.165841
H  4.972171 0.830596 -1.903926
H  -3.843548 0.028818 0.691626
H  -4.976771 0.142567 -0.647304
H  -4.635743 1.562207 0.338129
H  -2.279173 -1.639719 0.100771
H  -1.702618 -3.096829 0.897485
H  -2.354196 -3.61577 -1.41252
H  -1.253389 -2.403602 -2.060081
H  -0.615024 -3.842181 -1.247086
elementType: S P O C H
totalener: -1604.68099789 hartree
nucrepener: 1295.08471954 hartree
electener: -2899.76571743 hartree
oneelecener: -4784.45603213 hartree
twoeener: 1884.69031469 hartree
cpcmener: -0.02384914 hartree
kineticenergy: 1600.32171345 hartree
xcener: -101.620563764605 hartree
chargesum: 0.0000000
charge: -0.176146 -0.195638 0.744672 -0.355517 -0.646504 -0.118739 -0.082725 -0.100351 -0.118414 -0.255217 -0.260516 0.053619 -0.247582 0.129867 0.118487 0.119861 0.128797 0.064490 0.077496 0.088082 0.062791 0.072674 0.084664 0.092756 0.072136 0.095672 0.092112 0.074188 0.114568 0.097612 0.078579 0.094223
qa: -0.1761 -0.1956 0.7447 -0.3555 -0.6465 -0.1187 -0.0827 -0.1004 -0.1184 -0.2552 -0.2605 0.0536 -0.2476 0.1299 0.1185 0.1199 0.1288 0.0645 0.0775 0.0881 0.0628 0.0727 0.0847 0.0928 0.0721 0.0957 0.0921 0.0742 0.1146 0.0976 0.0786 0.0942
va: 2.2996 2.2758 5.3613 2.1020 1.9221 3.8861 3.8456 3.8792 3.9114 3.9253 3.9200 3.8862 3.9232 1.0025 1.0259 1.0285 1.0043 1.0330 1.0081 1.0096 1.0123 1.0156 1.0002 1.0050 1.0088 1.0046 1.0010 0.9914 0.9926 1.0064 1.0194 1.0059
dispcorr: -0.014344420 hartree
energy: -1604.695342310294
dipole: -6.12603 5.11688 -1.00916 2.38401 -1.66679 0.71722 -9.83355 10.15541 0.32186
magnitude: 1.27922 au
magnitude: 3.25151 debye
