program: Orca
programVersion: 5.0.2
elementType: S S P O O C C C C C C C C H H H H H H H H H H H H H H H H H H H
charge: 0
multiplicity: 1
keywords: wb97x-d3
keywords: def2-TZVPP
keywords: def2/J RIJCOSX
keywords: DEFGRID2
keywords: scfconv7
keywords: smallprint printgap noloewdin
keywords: NOSOSCF
formula: C8H19O2PS2
InChI: InChI=1/C8H19O2PS2/c1-4-7-12-11(9,10-6-3)13-8-5-2/h4-8H2,1-3H3
32 atoms
S  0.917104 -0.279277 1.031344
S  -1.216916 0.539877 -1.478769
P  -0.006354 -0.957972 -0.702404
O  -1.003338 -2.036315 -0.071072
O  0.916476 -1.427708 -1.765171
C  2.029781 0.979438 0.299424
C  -2.286999 1.001613 -0.061479
C  3.009341 1.460648 1.358809
C  -1.816349 2.253767 0.656364
C  3.936597 2.529577 0.799263
C  -2.77157 2.634085 1.779174
C  -0.887693 -3.4445 -0.373207
C  0.254849 -4.091235 0.37238
H  1.424668 1.805102 -0.077746
H  2.56339 0.530479 -0.538536
H  -2.373508 0.15367 0.618808
H  -3.276712 1.151637 -0.496789
H  2.46344 1.860818 2.216765
H  3.597694 0.615499 1.72283
H  -0.816001 2.087839 1.061231
H  -1.738248 3.076266 -0.058059
H  4.508149 2.157613 -0.052899
H  4.65034 2.856788 1.556124
H  3.380194 3.408471 0.46878
H  -2.840747 1.844623 2.529937
H  -3.778615 2.822736 1.402177
H  -2.435775 3.540096 2.285268
H  -0.789358 -3.58857 -1.451071
H  -1.842398 -3.871288 -0.068469
H  0.236316 -5.166478 0.187072
H  1.223569 -3.717047 0.03968
H  0.169531 -3.934829 1.448357
elementType: S P O C H
totalener: -1604.69058241 hartree
nucrepener: 1275.16788462 hartree
electener: -2879.85846703 hartree
oneelecener: -4744.19485252 hartree
twoeener: 1864.33638549 hartree
cpcmener: -0.02057902 hartree
kineticenergy: 1600.29397654 hartree
xcener: -101.612687636316 hartree
chargesum: -0.0000000
charge: -0.177690 -0.179008 0.735646 -0.358667 -0.626873 -0.107944 -0.100882 -0.086854 -0.085740 -0.276213 -0.268197 0.042776 -0.252556 0.102299 0.128367 0.110301 0.124485 0.072385 0.075725 0.058220 0.070288 0.084781 0.093715 0.084803 0.083536 0.085743 0.093982 0.096868 0.103881 0.098652 0.085205 0.088967
qa: -0.1777 -0.1790 0.7356 -0.3587 -0.6269 -0.1079 -0.1009 -0.0869 -0.0857 -0.2762 -0.2682 0.0428 -0.2526 0.1023 0.1284 0.1103 0.1245 0.0724 0.0757 0.0582 0.0703 0.0848 0.0937 0.0848 0.0835 0.0857 0.0940 0.0969 0.1039 0.0987 0.0852 0.0890
va: 2.2897 2.2811 5.3706 2.0849 1.9804 3.8939 3.8665 3.8941 3.8899 3.9558 3.9584 3.8607 3.9016 1.0091 1.0185 1.0265 1.0098 1.0094 1.0123 1.0198 1.0113 1.0005 1.0042 1.0003 1.0015 1.0017 1.0035 1.0043 0.9906 1.0109 1.0189 1.0044
dispcorr: -0.013239452 hartree
energy: -1604.703821867420
dipole: 3.31866 -4.06736 -0.74870 9.99035 -9.36862 0.62173 12.23653 -10.74133 1.49519
magnitude: 1.78401 au
magnitude: 4.53460 debye
