program: Orca
programVersion: 5.0.2
elementType: S S P O O C C C C C C C C H H H H H H H H H H H H H H H H H H H
charge: 0
multiplicity: 1
keywords: wb97x-d3
keywords: def2-TZVPP
keywords: def2/J RIJCOSX
keywords: DEFGRID2
keywords: scfconv7
keywords: smallprint printgap noloewdin
keywords: NOSOSCF
formula: C8H19O2PS2
InChI: InChI=1/C8H19O2PS2/c1-4-7-12-11(9,10-6-3)13-8-5-2/h4-8H2,1-3H3
32 atoms
S  0.758067 0.7851 0.892564
S  -2.362967 -0.189943 0.086784
P  -0.355807 -0.493648 -0.335654
O  -0.258349 -1.938501 0.343248
O  0.021527 -0.363454 -1.767317
C  2.035541 1.404927 -0.263952
C  -2.729372 1.167148 -1.088958
C  3.177482 0.440863 -0.528526
C  -2.153958 2.523497 -0.72322
C  3.99559 0.100259 0.705071
C  -2.611141 3.047297 0.626812
C  0.990934 -2.638967 0.505011
C  1.363437 -3.416691 -0.732717
H  2.401462 2.313257 0.219402
H  1.54394 1.711331 -1.185995
H  -3.820473 1.203554 -1.100902
H  -2.412432 0.850502 -2.081893
H  2.794902 -0.468966 -0.997466
H  3.823242 0.914764 -1.274175
H  -1.062718 2.493057 -0.765366
H  -2.466132 3.214919 -1.511575
H  4.822142 -0.56433 0.451636
H  3.395933 -0.399737 1.467692
H  4.420819 0.998223 1.15804
H  -2.218054 4.0483 0.807168
H  -2.271791 2.409166 1.444292
H  -3.700791 3.1058 0.680772
H  0.83526 -3.306898 1.351235
H  1.781506 -1.93806 0.785794
H  2.265641 -3.995147 -0.529221
H  0.575955 -4.116261 -1.01526
H  1.570099 -2.765573 -1.58172
elementType: S P O C H
totalener: -1604.68920589 hartree
nucrepener: 1307.40629930 hartree
electener: -2912.09550520 hartree
oneelecener: -4808.90615576 hartree
twoeener: 1896.81065056 hartree
cpcmener: -0.01931026 hartree
kineticenergy: 1600.31401071 hartree
xcener: -101.618147558148 hartree
chargesum: 0.0000000
charge: -0.198708 -0.179398 0.728045 -0.349545 -0.617972 -0.083690 -0.118048 -0.116357 -0.103601 -0.258876 -0.258123 0.043974 -0.244681 0.126819 0.119275 0.125694 0.125659 0.062993 0.086063 0.057821 0.083847 0.095006 0.073338 0.089961 0.094800 0.071064 0.088003 0.113069 0.074877 0.095187 0.095215 0.078286
qa: -0.1987 -0.1794 0.7280 -0.3495 -0.6180 -0.0837 -0.1180 -0.1164 -0.1036 -0.2589 -0.2581 0.0440 -0.2447 0.1268 0.1193 0.1257 0.1257 0.0630 0.0861 0.0578 0.0838 0.0950 0.0733 0.0900 0.0948 0.0711 0.0880 0.1131 0.0749 0.0952 0.0952 0.0783
va: 2.2542 2.2933 5.3806 2.1110 1.9644 3.8450 3.8865 3.9202 3.8811 3.9211 3.9277 3.8946 3.9148 1.0045 1.0287 1.0015 1.0258 1.0121 1.0103 1.0199 1.0096 1.0046 1.0079 1.0015 1.0044 1.0154 1.0022 0.9934 0.9964 1.0067 1.0063 1.0179
dispcorr: -0.015116689 hartree
energy: -1604.704322583352
dipole: 12.23038 -11.31381 0.91657 5.44600 -4.92691 0.51908 -1.55968 1.94702 0.38735
magnitude: 1.12231 au
magnitude: 2.85269 debye
