program: Orca
programVersion: 5.0.2
elementType: S S P O O C C C C C C C C H H H H H H H H H H H H H H H H H H H
charge: 0
multiplicity: 1
keywords: wb97x-d3
keywords: def2-TZVPP
keywords: def2/J RIJCOSX
keywords: DEFGRID2
keywords: scfconv7
keywords: smallprint printgap noloewdin
keywords: NOSOSCF
formula: C8H19O2PS2
InChI: InChI=1/C8H19O2PS2/c1-4-7-12-11(9,10-6-3)13-8-5-2/h4-8H2,1-3H3
32 atoms
S  0.92585 0.183202 1.28338
S  -1.036209 0.92889 -1.396161
P  0.123402 -0.535701 -0.500619
O  -0.934204 -1.593747 0.065847
O  1.119545 -1.026125 -1.488136
C  2.362441 1.123205 0.642879
C  -2.089809 1.574706 -0.046484
C  3.620424 0.282231 0.531009
C  -3.3882 0.812913 0.144182
C  4.805049 1.119468 0.072902
C  -4.234264 1.441285 1.241799
C  -0.482431 -2.882384 0.549524
C  -0.518579 -3.917908 -0.544838
H  2.498827 1.938177 1.355469
H  2.09142 1.58237 -0.309553
H  -2.287472 2.609193 -0.333797
H  -1.49586 1.610475 0.868908
H  3.84042 -0.170593 1.500284
H  3.451308 -0.537676 -0.168151
H  -3.945715 0.80521 -0.794947
H  -3.17648 -0.227458 0.39289
H  4.624093 1.570827 -0.904124
H  5.703561 0.507123 -0.010301
H  5.021247 1.925792 0.776084
H  -4.491673 2.475933 1.007931
H  -3.712447 1.437627 2.200423
H  -5.167482 0.892799 1.374611
H  -1.163917 -3.14104 1.358768
H  0.519031 -2.799506 0.979668
H  0.174502 -3.678847 -1.35096
H  -0.228705 -4.884454 -0.130379
H  -1.519633 -4.021169 -0.964026
elementType: S P O C H
totalener: -1604.69200308 hartree
nucrepener: 1273.88796142 hartree
electener: -2878.57996450 hartree
oneelecener: -4741.80658849 hartree
twoeener: 1863.22662399 hartree
cpcmener: -0.01997629 hartree
kineticenergy: 1600.30391052 hartree
xcener: -101.613133094848 hartree
chargesum: 0.0000000
charge: -0.191159 -0.165756 0.713881 -0.352344 -0.624484 -0.069276 -0.105353 -0.088673 -0.078540 -0.271081 -0.270947 0.048800 -0.240355 0.124253 0.103647 0.126901 0.109954 0.062645 0.065522 0.063587 0.066396 0.084790 0.092716 0.082665 0.083385 0.083652 0.092950 0.104281 0.088234 0.078968 0.092615 0.088127
qa: -0.1912 -0.1658 0.7139 -0.3523 -0.6245 -0.0693 -0.1054 -0.0887 -0.0785 -0.2711 -0.2709 0.0488 -0.2404 0.1243 0.1036 0.1269 0.1100 0.0626 0.0655 0.0636 0.0664 0.0848 0.0927 0.0827 0.0834 0.0837 0.0929 0.1043 0.0882 0.0790 0.0926 0.0881
va: 2.2866 2.3047 5.4099 2.0819 1.9828 3.8436 3.8531 3.8969 3.8858 3.9564 3.9563 3.8581 3.9323 1.0058 1.0279 1.0051 1.0308 1.0140 1.0310 1.0144 1.0255 1.0006 1.0040 1.0009 1.0008 1.0002 1.0040 0.9921 1.0071 1.0227 1.0077 1.0039
dispcorr: -0.013029549 hartree
energy: -1604.705032633069
dipole: 0.24439 -0.85253 -0.60813 0.54891 -0.05520 0.49372 7.12370 -5.40031 1.72339
magnitude: 1.89306 au
magnitude: 4.81177 debye
