program: Orca
programVersion: 5.0.2
elementType: S S P O O C C C C C C C C H H H H H H H H H H H H H H H H H H H
charge: 0
multiplicity: 1
keywords: wb97x-d3
keywords: def2-TZVPP
keywords: def2/J RIJCOSX
keywords: DEFGRID2
keywords: scfconv7
keywords: smallprint printgap noloewdin
keywords: NOSOSCF
formula: C8H19O2PS2
InChI: InChI=1/C8H19O2PS2/c1-4-7-12-11(9,10-6-3)13-8-5-2/h4-8H2,1-3H3
32 atoms
S  1.593684 -0.830275 0.957349
S  -1.116881 0.919754 0.587775
P  -0.057356 -0.626832 -0.293762
O  -0.94365 -1.916104 0.048586
O  0.268216 -0.440909 -1.732703
C  2.813364 0.225623 0.086687
C  -2.457573 1.147165 -0.649844
C  2.572466 1.716437 0.23217
C  -3.038297 2.545989 -0.523368
C  3.67515 2.517058 -0.44561
C  -3.704053 2.826372 0.814113
C  -0.900767 -3.101493 -0.777373
C  0.374593 -3.892502 -0.619081
H  2.84817 -0.081481 -0.958382
H  3.766743 -0.058848 0.53644
H  -3.220244 0.3866 -0.48285
H  -2.035204 1.002782 -1.643581
H  1.607573 1.982739 -0.204625
H  2.518101 1.974429 1.292548
H  -2.257329 3.284036 -0.722257
H  -3.774075 2.651994 -1.325327
H  4.655098 2.294857 -0.01776
H  3.501891 3.587665 -0.330228
H  3.722841 2.305482 -1.515859
H  -4.164735 3.814863 0.815675
H  -2.993833 2.80369 1.643534
H  -4.486721 2.095961 1.028425
H  -1.064169 -2.825751 -1.820525
H  -1.758778 -3.68878 -0.453503
H  1.24343 -3.36282 -1.010561
H  0.563701 -4.1517 0.422857
H  0.277346 -4.822762 -1.180793
elementType: S P O C H
totalener: -1604.68997665 hartree
nucrepener: 1273.81018262 hartree
electener: -2878.50015928 hartree
oneelecener: -4741.97028595 hartree
twoeener: 1863.47012667 hartree
cpcmener: -0.01882533 hartree
kineticenergy: 1600.30369308 hartree
xcener: -101.613470163559 hartree
chargesum: 0.0000000
charge: -0.185239 -0.173280 0.738616 -0.367466 -0.625186 -0.083588 -0.105537 -0.086655 -0.107417 -0.269320 -0.252375 0.038191 -0.256211 0.112883 0.125403 0.113471 0.119866 0.054950 0.065627 0.072523 0.076101 0.083805 0.092893 0.084933 0.092612 0.075809 0.084698 0.097417 0.106586 0.086169 0.089983 0.099741
qa: -0.1852 -0.1733 0.7386 -0.3675 -0.6252 -0.0836 -0.1055 -0.0867 -0.1074 -0.2693 -0.2524 0.0382 -0.2562 0.1129 0.1254 0.1135 0.1199 0.0549 0.0656 0.0725 0.0761 0.0838 0.0929 0.0849 0.0926 0.0758 0.0847 0.0974 0.1066 0.0862 0.0900 0.0997
va: 2.2868 2.3041 5.3672 2.0767 1.9589 3.8553 3.9055 3.8873 3.9238 3.9623 3.9266 3.8678 3.9093 1.0280 1.0028 1.0095 1.0234 1.0320 1.0141 1.0142 1.0066 1.0013 1.0033 1.0009 1.0045 1.0066 1.0007 1.0065 0.9899 1.0122 1.0040 1.0109
dispcorr: -0.012803551 hartree
energy: -1604.702780205183
dipole: -0.51531 0.16780 -0.34750 8.94708 -9.01909 -0.07201 -4.31500 4.30681 -0.00819
magnitude: 0.35498 au
magnitude: 0.90229 debye
