program: Orca
programVersion: 5.0.2
elementType: S S P O O C C C C C C C C H H H H H H H H H H H H H H H H H H H
charge: 0
multiplicity: 1
keywords: wb97x-d3
keywords: def2-TZVPP
keywords: def2/J RIJCOSX
keywords: DEFGRID2
keywords: scfconv7
keywords: smallprint printgap noloewdin
keywords: NOSOSCF
formula: C8H19O2PS2
InChI: InChI=1/C8H19O2PS2/c1-4-7-12-11(9,10-6-3)13-8-5-2/h4-8H2,1-3H3
32 atoms
S  1.677776 -0.883399 0.596169
S  -1.141915 0.724826 0.55245
P  0.101843 -0.407152 -0.671047
O  -0.582666 -1.824942 -0.928867
O  0.434293 0.252493 -1.957581
C  2.494013 0.751749 0.749337
C  -2.207187 1.52918 -0.712017
C  3.495996 1.023633 -0.357347
C  -3.334649 2.282015 -0.022802
C  4.181221 2.366629 -0.154856
C  -4.325753 1.392362 0.709093
C  -1.152618 -2.671248 0.088138
C  -0.30905 -3.905027 0.288903
H  2.982375 0.722204 1.724373
H  1.726093 1.525279 0.802953
H  -2.60874 0.765272 -1.378332
H  -1.587531 2.208593 -1.293946
H  4.240998 0.225255 -0.376852
H  2.990666 1.006595 -1.323952
H  -2.920737 3.031026 0.657322
H  -3.855894 2.839839 -0.805463
H  3.46125 3.186857 -0.15505
H  4.898649 2.559125 -0.952799
H  4.723731 2.401931 0.791265
H  -3.869375 0.870868 1.551462
H  -4.746898 0.638189 0.04172
H  -5.15364 1.982271 1.103744
H  -2.149385 -2.935936 -0.264188
H  -1.275621 -2.123145 1.025212
H  -0.814285 -4.570241 0.990095
H  -0.168359 -4.450143 -0.644519
H  0.670992 -3.671171 0.705345
elementType: S P O C H
totalener: -1604.68998017 hartree
nucrepener: 1270.63235392 hartree
electener: -2875.32233410 hartree
oneelecener: -4735.27269523 hartree
twoeener: 1859.95036114 hartree
cpcmener: -0.02204953 hartree
kineticenergy: 1600.31153858 hartree
xcener: -101.616993828978 hartree
chargesum: -0.0000000
charge: -0.203947 -0.196833 0.723113 -0.348773 -0.616918 -0.079789 -0.087548 -0.079099 -0.105903 -0.272808 -0.256213 0.025655 -0.229251 0.127758 0.107297 0.111519 0.118413 0.063725 0.064337 0.072031 0.079045 0.084333 0.093560 0.082919 0.077494 0.082223 0.093909 0.109028 0.095549 0.093752 0.091792 0.079629
qa: -0.2039 -0.1968 0.7231 -0.3488 -0.6169 -0.0798 -0.0875 -0.0791 -0.1059 -0.2728 -0.2562 0.0257 -0.2293 0.1278 0.1073 0.1115 0.1184 0.0637 0.0643 0.0720 0.0790 0.0843 0.0936 0.0829 0.0775 0.0822 0.0939 0.1090 0.0955 0.0938 0.0918 0.0796
va: 2.2896 2.2760 5.4189 2.0890 1.9928 3.8615 3.9099 3.8875 3.9109 3.9598 3.9346 3.8446 3.9397 1.0039 1.0293 1.0113 1.0171 1.0145 1.0319 1.0117 1.0058 1.0004 1.0038 1.0006 1.0071 1.0015 1.0048 0.9957 1.0058 1.0080 1.0039 1.0070
dispcorr: -0.012443833 hartree
energy: -1604.702424005469
dipole: -3.39039 2.55053 -0.83986 6.40586 -6.32598 0.07988 4.04095 -2.44215 1.59879
magnitude: 1.80773 au
magnitude: 4.59488 debye
