program: Orca
programVersion: 5.0.2
elementType: S S P O O C C C C C C C C H H H H H H H H H H H H H H H H H H H
charge: 0
multiplicity: 1
keywords: wb97x-d3
keywords: def2-TZVPP
keywords: def2/J RIJCOSX
keywords: DEFGRID2
keywords: scfconv7
keywords: smallprint printgap noloewdin
keywords: NOSOSCF
formula: C8H19O2PS2
InChI: InChI=1/C8H19O2PS2/c1-4-7-12-11(9,10-6-3)13-8-5-2/h4-8H2,1-3H3
32 atoms
S  1.617388 -0.36671 1.189443
S  -0.940932 0.50915 -0.926114
P  0.447786 -0.955336 -0.424912
O  -0.36158 -2.096613 0.349456
O  1.195466 -1.318047 -1.655754
C  2.990932 0.456647 0.295244
C  -1.878342 0.701782 0.638656
C  2.662404 1.810602 -0.30544
C  -2.588475 2.04733 0.664943
C  2.244626 2.855195 0.713147
C  -1.655153 3.238816 0.798323
C  -1.39399 -2.864905 -0.307311
C  -0.837626 -4.146151 -0.876209
H  3.364993 -0.236799 -0.456554
H  3.767323 0.550957 1.057101
H  -1.18726 0.624021 1.480254
H  -2.596088 -0.114755 0.706181
H  3.565284 2.146038 -0.824141
H  1.896577 1.704154 -1.076816
H  -3.220992 2.154543 -0.220114
H  -3.27024 2.022049 1.519117
H  2.058328 3.81554 0.231317
H  3.02255 3.008326 1.463991
H  1.332372 2.569421 1.237315
H  -1.045021 3.159938 1.699844
H  -2.222669 4.167594 0.866289
H  -0.980011 3.330214 -0.053459
H  -1.877189 -2.267302 -1.084969
H  -2.138963 -3.068071 0.461053
H  -1.654547 -4.733924 -1.297222
H  -0.117484 -3.957485 -1.672241
H  -0.357345 -4.749503 -0.105461
elementType: S P O C H
totalener: -1604.69067494 hartree
nucrepener: 1302.75687989 hartree
electener: -2907.44755483 hartree
oneelecener: -4799.47501093 hartree
twoeener: 1892.02745610 hartree
cpcmener: -0.02121827 hartree
kineticenergy: 1600.30840017 hartree
xcener: -101.617175994925 hartree
chargesum: -0.0000000
charge: -0.180326 -0.180902 0.723019 -0.350271 -0.621629 -0.101280 -0.101045 -0.114621 -0.090648 -0.259703 -0.275248 0.039043 -0.242843 0.125518 0.123627 0.102795 0.124419 0.082015 0.067840 0.070804 0.078288 0.099428 0.094904 0.057606 0.083205 0.102548 0.078419 0.092717 0.109132 0.094000 0.080504 0.088683
qa: -0.1803 -0.1809 0.7230 -0.3503 -0.6216 -0.1013 -0.1010 -0.1146 -0.0906 -0.2597 -0.2752 0.0390 -0.2428 0.1255 0.1236 0.1028 0.1244 0.0820 0.0678 0.0708 0.0783 0.0994 0.0949 0.0576 0.0832 0.1025 0.0784 0.0927 0.1091 0.0940 0.0805 0.0887
va: 2.2816 2.2839 5.4012 2.0884 1.9932 3.8663 3.9096 3.8786 3.8972 3.9284 3.9425 3.8477 3.9530 1.0262 1.0026 1.0203 1.0072 1.0104 1.0222 1.0114 1.0055 1.0027 1.0049 1.0112 0.9966 1.0071 1.0039 1.0038 0.9877 1.0068 1.0187 1.0041
dispcorr: -0.014899047 hartree
energy: -1604.705573982629
dipole: -4.87743 3.61931 -1.25812 11.70783 -11.06229 0.64554 4.19329 -2.94007 1.25322
magnitude: 1.88949 au
magnitude: 4.80269 debye
