program: Orca
programVersion: 5.0.2
elementType: S S P O O C C C C C C C C H H H H H H H H H H H H H H H H H H H
charge: 0
multiplicity: 1
keywords: wb97x-d3
keywords: def2-TZVPP
keywords: def2/J RIJCOSX
keywords: DEFGRID2
keywords: scfconv7
keywords: smallprint printgap noloewdin
keywords: NOSOSCF
formula: C8H19O2PS2
InChI: InChI=1/C8H19O2PS2/c1-4-7-12-11(9,10-6-3)13-8-5-2/h4-8H2,1-3H3
32 atoms
S  1.973756 -0.353765 0.133445
S  -0.902577 0.931388 0.988691
P  0.027082 -0.126306 -0.544803
O  -0.521683 -1.625002 -0.543165
O  -0.147702 0.497096 -1.877944
C  2.573797 1.3779 -0.047848
C  -2.379725 1.555493 0.103617
C  3.999362 1.387572 -0.56954
C  -3.385949 0.486022 -0.281488
C  5.00326 0.720817 0.356613
C  -4.617457 1.101218 -0.928529
C  -0.53529 -2.480983 0.613085
C  -1.697529 -3.432237 0.495228
H  2.504938 1.860538 0.926394
H  1.916555 1.906117 -0.737634
H  -2.04352 2.124569 -0.762866
H  -2.820823 2.266461 0.805207
H  4.02744 0.925679 -1.558668
H  4.27386 2.436814 -0.709471
H  -2.93178 -0.22189 -0.977159
H  -3.673044 -0.082098 0.605774
H  4.983649 1.169074 1.351522
H  6.016616 0.823536 -0.03193
H  4.812006 -0.348182 0.47062
H  -4.356527 1.659554 -1.829132
H  -5.129283 1.784892 -0.249394
H  -5.329748 0.328392 -1.217868
H  -0.623199 -1.888297 1.52739
H  0.410899 -3.024731 0.653594
H  -2.649745 -2.901109 0.495984
H  -1.634029 -4.035788 -0.410383
H  -1.691668 -4.110363 1.349008
elementType: S P O C H
totalener: -1604.69146454 hartree
nucrepener: 1271.13831439 hartree
electener: -2875.82977894 hartree
oneelecener: -4736.27255960 hartree
twoeener: 1860.44278067 hartree
cpcmener: -0.02165000 hartree
kineticenergy: 1600.32190249 hartree
xcener: -101.618120954988 hartree
chargesum: -0.0000000
charge: -0.198668 -0.190865 0.724347 -0.345006 -0.619304 -0.092268 -0.079439 -0.098075 -0.097931 -0.254273 -0.266675 0.014542 -0.240254 0.112069 0.117934 0.113488 0.125227 0.070510 0.075186 0.062663 0.065833 0.085197 0.093186 0.075699 0.084644 0.084204 0.093080 0.105156 0.112511 0.085270 0.090630 0.091381
qa: -0.1987 -0.1909 0.7243 -0.3450 -0.6193 -0.0923 -0.0794 -0.0981 -0.0979 -0.2543 -0.2667 0.0145 -0.2403 0.1121 0.1179 0.1135 0.1252 0.0705 0.0752 0.0627 0.0658 0.0852 0.0932 0.0757 0.0846 0.0842 0.0931 0.1052 0.1125 0.0853 0.0906 0.0914
va: 2.2950 2.2798 5.4254 2.0816 1.9934 3.8930 3.8567 3.9383 3.8900 3.9243 3.9644 3.8402 3.9608 1.0098 1.0222 1.0261 1.0031 1.0167 1.0082 1.0275 1.0128 1.0004 1.0045 1.0078 1.0013 1.0006 1.0035 0.9998 0.9899 1.0060 1.0042 1.0069
dispcorr: -0.012884579 hartree
energy: -1604.704349123587
dipole: -4.31828 4.15694 -0.16133 0.30384 -0.29914 0.00470 1.74543 -0.07765 1.66778
magnitude: 1.67557 au
magnitude: 4.25897 debye
