program: Orca
programVersion: 5.0.2
elementType: S S P O O C C C C C C C C H H H H H H H H H H H H H H H H H H H
charge: 0
multiplicity: 1
keywords: wb97x-d3
keywords: def2-TZVPP
keywords: def2/J RIJCOSX
keywords: DEFGRID2
keywords: scfconv7
keywords: smallprint printgap noloewdin
keywords: NOSOSCF
formula: C8H19O2PS2
InChI: InChI=1/C8H19O2PS2/c1-4-7-12-11(9,10-6-3)13-8-5-2/h4-8H2,1-3H3
32 atoms
S  1.726127 -0.767819 0.983596
S  -0.944565 1.063674 1.334993
P  -0.098376 -0.361429 0.080549
O  -0.913332 -1.706619 0.380917
O  -0.053032 0.05472 -1.345571
C  2.643881 0.759484 0.548416
C  -2.077272 1.903781 0.166975
C  3.290958 0.707914 -0.823963
C  -3.273127 1.071049 -0.256525
C  4.070735 1.983564 -1.108319
C  -4.189569 1.860546 -1.17923
C  -1.123237 -2.697653 -0.652264
C  0.115641 -3.505217 -0.951392
H  3.396069 0.860498 1.332453
H  1.968372 1.611366 0.64986
H  -1.496237 2.246628 -0.688899
H  -2.399839 2.792898 0.712551
H  3.957031 -0.155639 -0.879571
H  2.52633 0.56587 -1.588166
H  -2.938639 0.166961 -0.769492
H  -3.821949 0.745093 0.629402
H  4.531488 1.944509 -2.096088
H  4.868113 2.138646 -0.37916
H  3.423021 2.861917 -1.083386
H  -3.671674 2.15942 -2.092465
H  -4.560776 2.766245 -0.69596
H  -5.05474 1.26481 -1.472067
H  -1.501446 -2.214096 -1.554585
H  -1.915264 -3.334962 -0.26279
H  -0.142325 -4.2919 -1.661789
H  0.90304 -2.901727 -1.4040
H  0.512104 -3.98322 -0.055263
elementType: S P O C H
totalener: -1604.69184871 hartree
nucrepener: 1280.94253080 hartree
electener: -2885.63437951 hartree
oneelecener: -4756.19313094 hartree
twoeener: 1870.55875143 hartree
cpcmener: -0.01836616 hartree
kineticenergy: 1600.31087926 hartree
xcener: -101.614373832567 hartree
chargesum: -0.0000000
charge: -0.181928 -0.178452 0.720212 -0.369542 -0.618987 -0.083692 -0.088648 -0.090936 -0.085513 -0.270836 -0.269323 0.053146 -0.262411 0.127225 0.103897 0.111373 0.126455 0.064188 0.065703 0.058920 0.066815 0.092856 0.083283 0.084149 0.085122 0.084135 0.092897 0.094614 0.107971 0.099931 0.084876 0.092500
qa: -0.1819 -0.1785 0.7202 -0.3695 -0.6190 -0.0837 -0.0886 -0.0909 -0.0855 -0.2708 -0.2693 0.0531 -0.2624 0.1272 0.1039 0.1114 0.1265 0.0642 0.0657 0.0589 0.0668 0.0929 0.0833 0.0841 0.0851 0.0841 0.0929 0.0946 0.1080 0.0999 0.0849 0.0925
va: 2.2997 2.2985 5.3751 2.0641 1.9546 3.8539 3.8660 3.8908 3.8968 3.9563 3.9571 3.8442 3.9236 1.0030 1.0300 1.0289 1.0044 1.0137 1.0327 1.0207 1.0158 1.0039 1.0006 1.0005 1.0009 1.0008 1.0038 1.0048 0.9893 1.0108 1.0139 1.0025
dispcorr: -0.013377937 hartree
energy: -1604.705226648469
dipole: -1.18179 0.96603 -0.21576 5.05764 -4.96568 0.09196 -12.46410 12.43281 -0.03129
magnitude: 0.23662 au
magnitude: 0.60143 debye
