program: Orca
programVersion: 5.0.2
elementType: S S P O O C C C C C C C C H H H H H H H H H H H H H H H H H H H
charge: 0
multiplicity: 1
keywords: wb97x-d3
keywords: def2-TZVPP
keywords: def2/J RIJCOSX
keywords: DEFGRID2
keywords: scfconv7
keywords: smallprint printgap noloewdin
keywords: NOSOSCF
formula: C8H19O2PS2
InChI: InChI=1/C8H19O2PS2/c1-4-7-12-11(9,10-6-3)13-8-5-2/h4-8H2,1-3H3
32 atoms
S  1.938364 -0.872009 0.724319
S  -0.702444 1.061946 1.213648
P  0.040659 -0.441335 -0.011935
O  -0.789006 -1.725063 0.465522
O  0.002593 -0.120837 -1.463099
C  2.974366 0.210772 -0.329152
C  -1.94682 1.808408 0.095077
C  2.873594 1.688319 -0.000276
C  -3.178925 0.956408 -0.143349
C  3.805771 2.506094 -0.881131
C  -4.177677 1.682719 -1.032309
C  -0.628123 -2.995431 -0.204629
C  -1.671864 -3.180917 -1.277107
H  2.727956 0.008324 -1.371207
H  3.989075 -0.155977 -0.161238
H  -1.450686 2.075657 -0.838062
H  -2.212401 2.742647 0.59455
H  1.847372 2.034071 -0.139962
H  3.115007 1.844978 1.053538
H  -2.896917 0.012177 -0.614032
H  -3.639842 0.705125 0.814245
H  3.548982 2.401735 -1.936915
H  4.846407 2.199221 -0.760257
H  3.743931 3.565892 -0.631631
H  -5.06679 1.073328 -1.197835
H  -3.748067 1.909476 -2.009848
H  -4.50185 2.624278 -0.585258
H  -0.729634 -3.748085 0.576881
H  0.380394 -3.088257 -0.616519
H  -1.570843 -4.179568 -1.703694
H  -2.680469 -3.092558 -0.872641
H  -1.5546 -2.459253 -2.085191
elementType: S P O C H
totalener: -1604.69218873 hartree
nucrepener: 1281.91022114 hartree
electener: -2886.60240986 hartree
oneelecener: -4758.14478985 hartree
twoeener: 1871.54237998 hartree
cpcmener: -0.01838951 hartree
kineticenergy: 1600.31251605 hartree
xcener: -101.613591449896 hartree
chargesum: -0.0000000
charge: -0.191310 -0.172826 0.717643 -0.359870 -0.621191 -0.086131 -0.089385 -0.084259 -0.074234 -0.270001 -0.269714 0.050221 -0.260440 0.113187 0.126297 0.111519 0.126690 0.056041 0.065748 0.051126 0.066404 0.085148 0.083889 0.092754 0.092735 0.085098 0.084551 0.106977 0.086731 0.102128 0.089531 0.084943
qa: -0.1913 -0.1728 0.7176 -0.3599 -0.6212 -0.0861 -0.0894 -0.0843 -0.0742 -0.2700 -0.2697 0.0502 -0.2604 0.1132 0.1263 0.1115 0.1267 0.0560 0.0657 0.0511 0.0664 0.0851 0.0839 0.0928 0.0927 0.0851 0.0846 0.1070 0.0867 0.1021 0.0895 0.0849
va: 2.2963 2.2818 5.3756 2.0749 1.9584 3.8603 3.8685 3.8915 3.9026 3.9616 3.9574 3.8643 3.9257 1.0280 1.0026 1.0273 1.0038 1.0249 1.0146 1.0210 1.0162 1.0009 1.0015 1.0035 1.0040 1.0012 1.0010 0.9912 1.0098 1.0092 1.0025 1.0178
dispcorr: -0.013484985 hartree
energy: -1604.705673710049
dipole: -5.50397 5.48757 -0.01641 6.32588 -6.41583 -0.08995 -10.92940 10.94338 0.01398
magnitude: 0.09249 au
magnitude: 0.23510 debye
