program: Orca
programVersion: 5.0.2
elementType: S S P O O C C C C C C C C H H H H H H H H H H H H H H H H H H H
charge: 0
multiplicity: 1
keywords: wb97x-d3
keywords: def2-TZVPP
keywords: def2/J RIJCOSX
keywords: DEFGRID2
keywords: scfconv7
keywords: smallprint printgap noloewdin
keywords: NOSOSCF
formula: C8H19O2PS2
InChI: InChI=1/C8H19O2PS2/c1-4-7-12-11(9,10-6-3)13-8-5-2/h4-8H2,1-3H3
32 atoms
S  1.816807 -0.721698 -0.000264
S  -0.874913 0.840194 0.980239
P  -0.100364 -0.235404 -0.627979
O  -0.81345 -1.661471 -0.700499
O  -0.207894 0.479131 -1.922958
C  2.581129 0.947376 -0.004427
C  -2.230734 1.759486 0.164301
C  4.091424 0.805856 0.094396
C  -3.410398 0.900709 -0.253486
C  4.760262 2.172224 0.114586
C  -4.547823 1.762093 -0.783377
C  -1.081475 -2.51647 0.4278
C  -0.229079 -3.758469 0.368698
H  2.185553 1.515113 0.837564
H  2.301391 1.453774 -0.928355
H  -1.81321 2.315072 -0.675075
H  -2.5320 2.490526 0.917645
H  4.354752 0.254271 1.000201
H  4.462296 0.223555 -0.751904
H  -3.100548 0.190633 -1.023269
H  -3.754066 0.312092 0.599878
H  4.431792 2.765253 0.969668
H  4.536006 2.739753 -0.790136
H  5.844046 2.072062 0.180326
H  -4.91117 2.454707 -0.022057
H  -5.390762 1.145028 -1.096141
H  -4.233928 2.351713 -1.646472
H  -2.140561 -2.768599 0.371837
H  -0.926699 -1.980477 1.367036
H  -0.376106 -4.301744 -0.564985
H  0.8325 -3.533641 0.476977
H  -0.510976 -4.421078 1.187811
elementType: S P O C H
totalener: -1604.69132461 hartree
nucrepener: 1265.02025216 hartree
electener: -2869.71157676 hartree
oneelecener: -4723.98574283 hartree
twoeener: 1854.27416607 hartree
cpcmener: -0.02182329 hartree
kineticenergy: 1600.30699320 hartree
xcener: -101.615401285587 hartree
chargesum: 0.0000000
charge: -0.197944 -0.195772 0.726485 -0.351197 -0.618820 -0.093132 -0.077091 -0.085980 -0.096589 -0.277076 -0.268384 0.022948 -0.226384 0.108695 0.116290 0.113621 0.124874 0.073103 0.074727 0.067516 0.065616 0.084200 0.084725 0.093739 0.083573 0.093171 0.085592 0.109733 0.096191 0.091404 0.078094 0.094073
qa: -0.1979 -0.1958 0.7265 -0.3512 -0.6188 -0.0931 -0.0771 -0.0860 -0.0966 -0.2771 -0.2684 0.0229 -0.2264 0.1087 0.1163 0.1136 0.1249 0.0731 0.0747 0.0675 0.0656 0.0842 0.0847 0.0937 0.0836 0.0932 0.0856 0.1097 0.0962 0.0914 0.0781 0.0941
va: 2.3109 2.2767 5.4168 2.0753 1.9936 3.9170 3.8556 3.9000 3.8843 3.9578 3.9623 3.8414 3.9537 1.0128 1.0159 1.0264 1.0033 1.0091 1.0123 1.0247 1.0140 1.0008 1.0005 1.0042 1.0006 1.0037 1.0008 0.9932 1.0057 1.0040 1.0076 1.0074
dispcorr: -0.012558944 hartree
energy: -1604.703883553648
dipole: -1.29022 1.09174 -0.19848 4.59648 -4.62342 -0.02694 2.83558 -1.03114 1.80445
magnitude: 1.81553 au
magnitude: 4.61471 debye
