program: Orca
programVersion: 5.0.2
elementType: S S P O O C C C C C C C C H H H H H H H H H H H H H H H H H H H
charge: 0
multiplicity: 1
keywords: wb97x-d3
keywords: def2-TZVPP
keywords: def2/J RIJCOSX
keywords: DEFGRID2
keywords: scfconv7
keywords: smallprint printgap noloewdin
keywords: NOSOSCF
formula: C8H19O2PS2
InChI: InChI=1/C8H19O2PS2/c1-4-7-12-11(9,10-6-3)13-8-5-2/h4-8H2,1-3H3
32 atoms
S  0.764622 0.954637 0.705691
S  -2.129464 -0.337999 -0.088862
P  -0.159254 -0.221994 -0.74676
O  0.370589 -1.721404 -0.581359
O  0.037236 0.260436 -2.136002
C  2.352638 1.336493 -0.129393
C  -2.855012 1.120776 -0.935894
C  3.314365 0.169954 -0.268875
C  -2.487427 2.465877 -0.337995
C  3.742988 -0.446008 1.051415
C  -2.891813 2.62839 1.116283
C  0.307864 -2.466627 0.647381
C  1.315248 -3.584157 0.581104
H  2.786945 2.120163 0.496187
H  2.123819 1.787033 -1.09481
H  -3.929796 0.944625 -0.860326
H  -2.593617 1.061548 -1.991574
H  2.890036 -0.59147 -0.927416
H  4.193977 0.557006 -0.792818
H  -1.417337 2.647724 -0.456322
H  -2.991349 3.221368 -0.947898
H  4.472872 -1.240166 0.889347
H  2.900683 -0.878634 1.594161
H  4.206092 0.298735 1.702919
H  -3.963811 2.467312 1.2507
H  -2.661823 3.633395 1.472455
H  -2.366153 1.924315 1.763418
H  -0.702568 -2.864489 0.766916
H  0.51773 -1.812572 1.497431
H  1.250498 -4.174845 1.495367
H  1.121782 -4.250065 -0.260061
H  2.333613 -3.203063 0.499319
elementType: S P O C H
totalener: -1604.69024127 hartree
nucrepener: 1307.25265318 hartree
electener: -2911.94289444 hartree
oneelecener: -4808.48436456 hartree
twoeener: 1896.54147012 hartree
cpcmener: -0.02120968 hartree
kineticenergy: 1600.30427065 hartree
xcener: -101.616753157554 hartree
chargesum: 0.0000000
charge: -0.193595 -0.203825 0.723305 -0.344847 -0.619900 -0.095604 -0.095612 -0.101768 -0.119838 -0.280099 -0.252223 -0.009517 -0.241858 0.124295 0.125576 0.125886 0.128297 0.065459 0.084161 0.067452 0.085090 0.099673 0.073854 0.096538 0.087657 0.094255 0.069941 0.121337 0.114644 0.091438 0.093584 0.086243
qa: -0.1936 -0.2038 0.7233 -0.3448 -0.6199 -0.0956 -0.0956 -0.1018 -0.1198 -0.2801 -0.2522 -0.0095 -0.2419 0.1243 0.1256 0.1259 0.1283 0.0655 0.0842 0.0675 0.0851 0.0997 0.0739 0.0965 0.0877 0.0943 0.0699 0.1213 0.1146 0.0914 0.0936 0.0862
va: 2.2641 2.2741 5.4064 2.0799 1.9933 3.8714 3.8740 3.8649 3.8808 3.9383 3.9248 3.8411 3.9572 1.0035 1.0248 1.0008 1.0259 1.0266 1.0098 1.0229 1.0101 1.0018 1.0000 1.0043 1.0020 1.0048 1.0129 0.9925 0.9915 1.0053 1.0045 1.0035
dispcorr: -0.014912947 hartree
energy: -1604.705154212279
dipole: 7.87591 -7.63564 0.24027 1.29406 -1.24963 0.04443 7.72268 -6.20091 1.52177
magnitude: 1.54126 au
magnitude: 3.91758 debye
