program: Orca
programVersion: 5.0.2
elementType: S S P O O C C C C C C C C H H H H H H H H H H H H H H H H H H H
charge: 0
multiplicity: 1
keywords: wb97x-d3
keywords: def2-TZVPP
keywords: def2/J RIJCOSX
keywords: DEFGRID2
keywords: scfconv7
keywords: smallprint printgap noloewdin
keywords: NOSOSCF
formula: C8H19O2PS2
InChI: InChI=1/C8H19O2PS2/c1-4-7-12-11(9,10-6-3)13-8-5-2/h4-8H2,1-3H3
32 atoms
S  1.631741 -0.113694 0.877023
S  -1.68783 -0.116788 0.439795
P  0.102816 -0.833479 -0.335257
O  0.046106 -2.370413 0.098069
O  0.302113 -0.554035 -1.780786
C  2.825102 0.498948 -0.374683
C  -1.597739 1.601689 -0.18406
C  2.517885 1.895364 -0.882553
C  -2.833882 2.366209 0.263508
C  2.607919 2.968943 0.187466
C  -2.773642 3.811273 -0.208585
C  -0.930728 -3.265406 -0.485004
C  -0.33472 -4.646815 -0.554399
H  2.882801 -0.225685 -1.184772
H  3.786368 0.47551 0.142731
H  -1.53331 1.576768 -1.271315
H  -0.693042 2.069195 0.209949
H  3.24031 2.110099 -1.675679
H  1.534393 1.909994 -1.356233
H  -3.728977 1.883496 -0.135689
H  -2.916031 2.336647 1.352519
H  2.410614 3.955517 -0.233322
H  3.602399 2.995693 0.637437
H  1.885853 2.806262 0.989501
H  -1.910352 4.331313 0.210077
H  -3.667347 4.356446 0.096626
H  -2.705115 3.873627 -1.295915
H  -1.216516 -2.920985 -1.481102
H  -1.822148 -3.256928 0.144608
H  -0.036728 -5.005744 0.431044
H  -1.080649 -5.337514 -0.948718
H  0.532113 -4.675863 -1.214858
elementType: S P O C H
totalener: -1604.69097307 hartree
nucrepener: 1269.58429228 hartree
electener: -2874.27526535 hartree
oneelecener: -4733.27032345 hartree
twoeener: 1858.99505810 hartree
cpcmener: -0.01946548 hartree
kineticenergy: 1600.31437703 hartree
xcener: -101.613795090168 hartree
chargesum: -0.0000000
charge: -0.185988 -0.187277 0.738508 -0.361918 -0.622076 -0.078238 -0.084369 -0.124764 -0.086444 -0.253767 -0.275270 0.026313 -0.244360 0.119270 0.124597 0.116370 0.097589 0.082503 0.065486 0.075417 0.072508 0.093846 0.088182 0.070353 0.084414 0.093960 0.083711 0.104093 0.103073 0.088382 0.088034 0.087863
qa: -0.1860 -0.1873 0.7385 -0.3619 -0.6221 -0.0782 -0.0844 -0.1248 -0.0864 -0.2538 -0.2753 0.0263 -0.2444 0.1193 0.1246 0.1164 0.0976 0.0825 0.0655 0.0754 0.0725 0.0938 0.0882 0.0704 0.0844 0.0940 0.0837 0.1041 0.1031 0.0884 0.0880 0.0879
va: 2.2682 2.3039 5.3969 2.1161 1.9682 3.8348 3.9254 3.9103 3.8987 3.9169 3.9550 3.8673 3.9751 1.0315 1.0066 1.0175 1.0048 1.0102 1.0177 1.0118 1.0104 1.0047 1.0021 1.0132 1.0004 1.0043 1.0010 0.9941 0.9896 1.0030 1.0061 1.0064
dispcorr: -0.012922920 hartree
energy: -1604.703895993699
dipole: -1.38061 1.13516 -0.24546 13.41207 -12.92300 0.48907 -3.94400 4.17712 0.23312
magnitude: 0.59480 au
magnitude: 1.51185 debye
