program: Orca
programVersion: 5.0.2
elementType: S S P O O C C C C C C C C H H H H H H H H H H H H H H H H H H H
charge: 0
multiplicity: 1
keywords: wb97x-d3
keywords: def2-TZVPP
keywords: def2/J RIJCOSX
keywords: DEFGRID2
keywords: scfconv7
keywords: smallprint printgap noloewdin
keywords: NOSOSCF
formula: C8H19O2PS2
InChI: InChI=1/C8H19O2PS2/c1-4-7-12-11(9,10-6-3)13-8-5-2/h4-8H2,1-3H3
32 atoms
S  1.859578 0.154268 1.044159
S  -1.262791 1.041683 1.192104
P  0.048164 -0.082011 0.052601
O  -0.396927 -1.569607 0.438548
O  0.071191 0.22288 -1.403258
C  2.75356 1.335347 -0.040846
C  -2.828822 0.751764 0.275883
C  3.891338 0.675973 -0.800531
C  -3.068924 1.757324 -0.833843
C  3.458542 -0.366742 -1.8145
C  -4.376538 1.471437 -1.55598
C  0.160069 -2.712607 -0.24888
C  -0.911955 -3.761856 -0.383849
H  3.132312 2.109887 0.626167
H  2.040739 1.80901 -0.715197
H  -3.608552 0.814256 1.03767
H  -2.837826 -0.274332 -0.095264
H  4.43169 1.479928 -1.309381
H  4.598209 0.239278 -0.090077
H  -3.087884 2.764784 -0.41161
H  -2.239599 1.728181 -1.542512
H  2.959682 -1.212569 -1.339394
H  4.323616 -0.760229 -2.349199
H  2.775675 0.051309 -2.555083
H  -5.226241 1.493458 -0.871213
H  -4.361521 0.490274 -2.034056
H  -4.562024 2.213206 -2.333214
H  1.003876 -3.082205 0.337467
H  0.534445 -2.422235 -1.232976
H  -1.298839 -4.070478 0.588127
H  -1.741888 -3.406067 -0.99518
H  -0.490712 -4.642766 -0.870281
elementType: S P O C H
totalener: -1604.69090252 hartree
nucrepener: 1275.60158714 hartree
electener: -2880.29248966 hartree
oneelecener: -4745.54027134 hartree
twoeener: 1865.24778167 hartree
cpcmener: -0.01913034 hartree
kineticenergy: 1600.31215876 hartree
xcener: -101.613027846289 hartree
chargesum: 0.0000000
charge: -0.193156 -0.175108 0.721586 -0.348574 -0.617337 -0.084635 -0.093418 -0.083448 -0.085990 -0.265634 -0.269552 0.042292 -0.247311 0.124598 0.104711 0.127315 0.106053 0.074173 0.066958 0.063459 0.062585 0.066414 0.097833 0.083685 0.081787 0.084307 0.093261 0.102179 0.093598 0.089575 0.086917 0.090878
qa: -0.1932 -0.1751 0.7216 -0.3486 -0.6173 -0.0846 -0.0934 -0.0834 -0.0860 -0.2656 -0.2696 0.0423 -0.2473 0.1246 0.1047 0.1273 0.1061 0.0742 0.0670 0.0635 0.0626 0.0664 0.0978 0.0837 0.0818 0.0843 0.0933 0.1022 0.0936 0.0896 0.0869 0.0909
va: 2.2766 2.3005 5.4018 2.0812 1.9625 3.8611 3.8847 3.8847 3.8897 3.9449 3.9550 3.8574 3.9640 1.0086 1.0339 1.0026 1.0237 1.0091 1.0111 1.0134 1.0307 1.0052 1.0086 1.0077 1.0009 1.0010 1.0038 0.9926 0.9949 1.0031 1.0054 1.0070
dispcorr: -0.013372732 hartree
energy: -1604.704275255552
dipole: -3.53910 3.59807 0.05896 -4.32332 3.81675 -0.50657 -13.65823 13.67964 0.02142
magnitude: 0.51044 au
magnitude: 1.29742 debye
