program: Orca
programVersion: 5.0.2
elementType: S S P O O C C C C C C C C H H H H H H H H H H H H H H H H H H H
charge: 0
multiplicity: 1
keywords: wb97x-d3
keywords: def2-TZVPP
keywords: def2/J RIJCOSX
keywords: DEFGRID2
keywords: scfconv7
keywords: smallprint printgap noloewdin
keywords: NOSOSCF
formula: C8H19O2PS2
InChI: InChI=1/C8H19O2PS2/c1-4-7-12-11(9,10-6-3)13-8-5-2/h4-8H2,1-3H3
32 atoms
S  1.802695 -0.259903 1.165865
S  -1.231792 0.886307 1.239312
P  0.012711 -0.321418 0.109038
O  -0.542102 -1.786275 0.43947
O  0.12207 0.019028 -1.334655
C  2.744714 0.979104 0.197783
C  -2.784734 0.792446 0.262818
C  3.52489 0.362188 -0.947472
C  -2.895179 1.867151 -0.801792
C  4.335815 1.41349 -1.690171
C  -4.223031 1.768548 -1.538797
C  -0.049656 -2.928324 -0.298035
C  -0.958181 -3.262462 -1.454122
H  3.416205 1.438539 0.925225
H  2.065339 1.761406 -0.142616
H  -3.577242 0.896614 1.006186
H  -2.881239 -0.209969 -0.157212
H  4.189412 -0.411475 -0.55603
H  2.837133 -0.132348 -1.63522
H  -2.800417 2.850721 -0.336276
H  -2.068734 1.77251 -1.508134
H  3.692559 2.180414 -2.125429
H  4.905184 0.961527 -2.503124
H  5.046788 1.912167 -1.028848
H  -5.068383 1.872625 -0.856042
H  -4.326444 0.809584 -2.049749
H  -4.309984 2.553212 -2.291169
H  -0.016169 -3.74461 0.422714
H  0.974557 -2.753827 -0.638699
H  -1.977676 -3.453631 -1.117614
H  -0.979073 -2.463758 -2.195093
H  -0.595355 -4.165904 -1.945936
elementType: S P O C H
totalener: -1604.69230561 hartree
nucrepener: 1267.65443943 hartree
electener: -2872.34674504 hartree
oneelecener: -4729.60509150 hartree
twoeener: 1857.25834646 hartree
cpcmener: -0.01890960 hartree
kineticenergy: 1600.30373747 hartree
xcener: -101.610377473445 hartree
chargesum: 0.0000000
charge: -0.188047 -0.170675 0.709414 -0.356672 -0.617721 -0.072695 -0.089896 -0.096886 -0.083972 -0.268601 -0.270392 0.053546 -0.252778 0.125594 0.106976 0.127250 0.107105 0.064141 0.066253 0.062542 0.062000 0.084994 0.092688 0.082663 0.082321 0.084690 0.093394 0.107153 0.086265 0.088548 0.082930 0.097868
qa: -0.1880 -0.1707 0.7094 -0.3567 -0.6177 -0.0727 -0.0899 -0.0969 -0.0840 -0.2686 -0.2704 0.0535 -0.2528 0.1256 0.1070 0.1273 0.1071 0.0641 0.0663 0.0625 0.0620 0.0850 0.0927 0.0827 0.0823 0.0847 0.0934 0.1072 0.0863 0.0885 0.0829 0.0979
va: 2.2858 2.2961 5.3954 2.0707 1.9550 3.8369 3.8852 3.8973 3.8954 3.9546 3.9566 3.8682 3.9363 1.0063 1.0274 1.0030 1.0200 1.0128 1.0288 1.0137 1.0294 1.0009 1.0041 1.0010 1.0010 1.0007 1.0037 0.9923 1.0043 1.0030 1.0190 1.0085
dispcorr: -0.012871683 hartree
energy: -1604.705177290624
dipole: -1.89252 1.81010 -0.08241 2.13016 -2.53223 -0.40208 -15.80043 15.77664 -0.02378
magnitude: 0.41112 au
magnitude: 1.04499 debye
