program: Orca
programVersion: 5.0.2
elementType: S S P O O C C C C C C C C H H H H H H H H H H H H H H H H H H H
charge: 0
multiplicity: 1
keywords: wb97x-d3
keywords: def2-TZVPP
keywords: def2/J RIJCOSX
keywords: DEFGRID2
keywords: scfconv7
keywords: smallprint printgap noloewdin
keywords: NOSOSCF
formula: C8H19O2PS2
InChI: InChI=1/C8H19O2PS2/c1-4-7-12-11(9,10-6-3)13-8-5-2/h4-8H2,1-3H3
32 atoms
S  1.945441 -0.744885 0.883715
S  -0.883326 0.932534 0.844263
P  0.132785 -0.589679 -0.122019
O  -0.653804 -1.891677 0.376407
O  0.255656 -0.429027 -1.594243
C  3.015488 0.307447 -0.167086
C  -2.382258 1.017986 -0.214949
C  2.742616 1.795184 -0.048533
C  -3.207948 2.230701 0.182427
C  3.734857 2.600874 -0.873824
C  -4.477566 2.31354 -0.652137
C  -0.407139 -3.171392 -0.248184
C  -1.448684 -3.46335 -1.298669
H  2.936634 -0.040401 -1.196603
H  4.024516 0.071186 0.176923
H  -2.95358 0.098539 -0.086605
H  -2.067846 1.091562 -1.255738
H  1.727259 2.014832 -0.384967
H  2.797168 2.093927 1.000551
H  -3.467805 2.175647 1.242233
H  -2.615178 3.138256 0.047213
H  4.761484 2.433135 -0.542986
H  3.532148 3.66905 -0.78863
H  3.679394 2.339379 -1.932074
H  -4.250555 2.381259 -1.717472
H  -5.061803 3.194284 -0.38367
H  -5.111186 1.438067 -0.501381
H  -0.446978 -3.90208 0.559143
H  0.600073 -3.208821 -0.671178
H  -1.281385 -4.462436 -1.703178
H  -2.45475 -3.43809 -0.878878
H  -1.397473 -2.754672 -2.124953
elementType: S P O C H
totalener: -1604.69250929 hartree
nucrepener: 1262.98093590 hartree
electener: -2867.67344519 hartree
oneelecener: -4720.21533099 hartree
twoeener: 1852.54188580 hartree
cpcmener: -0.01903341 hartree
kineticenergy: 1600.31434463 hartree
xcener: -101.613477224762 hartree
chargesum: -0.0000000
charge: -0.184641 -0.166523 0.726311 -0.362311 -0.623892 -0.083759 -0.101262 -0.088300 -0.085490 -0.268593 -0.275954 0.046149 -0.249391 0.113807 0.124483 0.112745 0.111811 0.055081 0.066642 0.073447 0.073166 0.083896 0.093076 0.084573 0.084146 0.093875 0.083850 0.106835 0.089397 0.095753 0.087938 0.083136
qa: -0.1846 -0.1665 0.7263 -0.3623 -0.6239 -0.0838 -0.1013 -0.0883 -0.0855 -0.2686 -0.2760 0.0461 -0.2494 0.1138 0.1245 0.1127 0.1118 0.0551 0.0666 0.0734 0.0732 0.0839 0.0931 0.0846 0.0841 0.0939 0.0839 0.1068 0.0894 0.0958 0.0879 0.0831
va: 2.3008 2.2965 5.3857 2.0719 1.9586 3.8569 3.9209 3.8856 3.8884 3.9619 3.9560 3.8654 3.9386 1.0275 1.0024 1.0081 1.0186 1.0303 1.0136 1.0091 1.0119 1.0014 1.0033 1.0011 1.0007 1.0040 1.0010 0.9925 1.0060 1.0084 1.0032 1.0182
dispcorr: -0.012490111 hartree
energy: -1604.704999400920
dipole: -6.45496 6.20659 -0.24837 8.12090 -8.25513 -0.13423 -9.08821 9.22266 0.13445
magnitude: 0.31270 au
magnitude: 0.79482 debye
