program: Orca
programVersion: 5.0.2
elementType: S S P O O C C C C C C C C H H H H H H H H H H H H H H H H H H H
charge: 0
multiplicity: 1
keywords: wb97x-d3
keywords: def2-TZVPP
keywords: def2/J RIJCOSX
keywords: DEFGRID2
keywords: scfconv7
keywords: smallprint printgap noloewdin
keywords: NOSOSCF
formula: C8H19O2PS2
InChI: InChI=1/C8H19O2PS2/c1-4-7-12-11(9,10-6-3)13-8-5-2/h4-8H2,1-3H3
32 atoms
S  0.807326 -0.052868 0.921473
S  -2.240206 -0.083619 -0.234255
P  -0.278228 -0.482178 -0.801049
O  -0.259134 -2.067504 -0.997368
O  0.18403 0.205906 -2.031146
C  2.525407 -0.113864 0.270425
C  -2.3756 1.685767 -0.709344
C  3.022276 1.227402 -0.237685
C  -1.593716 2.662166 0.149059
C  3.092146 2.303205 0.832317
C  -1.951228 2.626554 1.623564
C  -0.492973 -3.012133 0.065854
C  0.777898 -3.74562 0.410318
H  2.586054 -0.884088 -0.498742
H  3.126921 -0.460977 1.112354
H  -3.447456 1.878524 -0.633551
H  -2.107298 1.772012 -1.761183
H  4.021524 1.059199 -0.65021
H  2.398873 1.559373 -1.069441
H  -0.521739 2.503859 0.015334
H  -1.802412 3.657026 -0.255332
H  2.106683 2.535214 1.240047
H  3.499685 3.2291 0.425009
H  3.732012 1.998094 1.662728
H  -3.017713 2.801413 1.778563
H  -1.407315 3.39718 2.170825
H  -1.702572 1.667086 2.078471
H  -1.255983 -3.698666 -0.300673
H  -0.899857 -2.515689 0.950813
H  1.530108 -3.075967 0.828544
H  0.558904 -4.508419 1.15851
H  1.200638 -4.245265 -0.461696
elementType: S P O C H
totalener: -1604.68888221 hartree
nucrepener: 1309.74395528 hartree
electener: -2914.43283749 hartree
oneelecener: -4813.52790660 hartree
twoeener: 1899.09506911 hartree
cpcmener: -0.02156473 hartree
kineticenergy: 1600.31381764 hartree
xcener: -101.618874567321 hartree
chargesum: -0.0000000
charge: -0.197176 -0.201475 0.726254 -0.355690 -0.618549 -0.099472 -0.097119 -0.106044 -0.106603 -0.254631 -0.258505 0.041809 -0.239262 0.124615 0.129321 0.126976 0.127677 0.078971 0.068940 0.055655 0.086351 0.071610 0.092848 0.085234 0.090865 0.095266 0.070337 0.110896 0.083506 0.076666 0.096652 0.094076
qa: -0.1972 -0.2015 0.7263 -0.3557 -0.6185 -0.0995 -0.0971 -0.1060 -0.1066 -0.2546 -0.2585 0.0418 -0.2393 0.1246 0.1293 0.1270 0.1277 0.0790 0.0689 0.0557 0.0864 0.0716 0.0928 0.0852 0.0909 0.0953 0.0703 0.1109 0.0835 0.0767 0.0967 0.0941
va: 2.2517 2.2714 5.4210 2.0900 1.9870 3.8549 3.8773 3.9161 3.8856 3.9295 3.9246 3.8518 3.9316 1.0183 1.0033 1.0002 1.0251 1.0099 1.0263 1.0175 1.0107 1.0094 1.0053 1.0014 1.0025 1.0046 1.0128 0.9957 1.0047 1.0102 1.0088 1.0031
dispcorr: -0.014780611 hartree
energy: -1604.703662821189
dipole: 9.12412 -8.88214 0.24198 8.31112 -8.56938 -0.25825 8.97118 -7.39765 1.57353
magnitude: 1.61284 au
magnitude: 4.09951 debye
