program: Orca
programVersion: 5.0.2
elementType: S S P O O C C C C C C C C H H H H H H H H H H H H H H H H H H H
charge: 0
multiplicity: 1
keywords: wb97x-d3
keywords: def2-TZVPP
keywords: def2/J RIJCOSX
keywords: DEFGRID2
keywords: scfconv7
keywords: smallprint printgap noloewdin
keywords: NOSOSCF
formula: C8H19O2PS2
InChI: InChI=1/C8H19O2PS2/c1-4-7-12-11(9,10-6-3)13-8-5-2/h4-8H2,1-3H3
32 atoms
S  1.87151 -0.123663 1.006966
S  -1.072744 1.290142 1.011843
P  0.090866 -0.050549 -0.058189
O  -0.550916 -1.473029 0.303948
O  0.202169 0.263341 -1.506613
C  2.860199 1.191946 0.190268
C  -2.385671 1.668627 -0.207907
C  4.007432 0.619861 -0.624542
C  -3.35945 0.532609 -0.463564
C  3.581643 -0.208037 -1.82417
C  -4.504253 0.985739 -1.358356
C  -0.066264 -2.67371 -0.339251
C  -1.124966 -3.736906 -0.209184
H  3.233586 1.823303 0.995905
H  2.201609 1.806975 -0.423262
H  -1.914654 2.014226 -1.128283
H  -2.899719 2.526475 0.231174
H  4.608443 1.470208 -0.960326
H  4.656178 0.030154 0.02769
H  -2.83996 -0.304654 -0.934084
H  -3.751696 0.165954 0.487281
H  4.455219 -0.567939 -2.368649
H  2.977617 0.376212 -2.51931
H  2.99972 -1.08188 -1.527515
H  -5.079873 1.788455 -0.894044
H  -5.190129 0.161967 -1.558467
H  -4.140412 1.351744 -2.319919
H  0.862068 -2.98278 0.145652
H  0.15016 -2.474355 -1.390591
H  -0.761682 -4.659414 -0.662693
H  -1.35852 -3.947435 0.834829
H  -2.043316 -3.450171 -0.722245
elementType: S P O C H
totalener: -1604.69200605 hartree
nucrepener: 1279.19705205 hartree
electener: -2883.88905809 hartree
oneelecener: -4752.76303724 hartree
twoeener: 1868.87397914 hartree
cpcmener: -0.01920571 hartree
kineticenergy: 1600.31351474 hartree
xcener: -101.613733819051 hartree
chargesum: 0.0000000
charge: -0.195730 -0.170654 0.724840 -0.352558 -0.619090 -0.082752 -0.098186 -0.085008 -0.077407 -0.266367 -0.268126 0.035864 -0.246508 0.125086 0.101353 0.114194 0.123634 0.074684 0.066669 0.052840 0.064978 0.096906 0.082909 0.069064 0.084298 0.092658 0.084201 0.099259 0.102244 0.089183 0.088749 0.088774
qa: -0.1957 -0.1707 0.7248 -0.3526 -0.6191 -0.0828 -0.0982 -0.0850 -0.0774 -0.2664 -0.2681 0.0359 -0.2465 0.1251 0.1014 0.1142 0.1236 0.0747 0.0667 0.0528 0.0650 0.0969 0.0829 0.0691 0.0843 0.0927 0.0842 0.0993 0.1022 0.0892 0.0887 0.0888
va: 2.2787 2.3099 5.3916 2.0774 1.9664 3.8703 3.8874 3.8936 3.8842 3.9433 3.9584 3.8504 3.9677 1.0091 1.0299 1.0247 1.0028 1.0090 1.0110 1.0285 1.0151 1.0080 1.0065 1.0073 1.0010 1.0036 1.0008 0.9944 0.9971 1.0066 1.0029 1.0041
dispcorr: -0.013467011 hartree
energy: -1604.705473058504
dipole: -4.20090 4.23540 0.03450 -4.96510 4.72064 -0.24446 -11.76498 11.85239 0.08741
magnitude: 0.26190 au
magnitude: 0.66569 debye
