program: Orca
programVersion: 5.0.2
elementType: S S P O O C C C C C C C C H H H H H H H H H H H H H H H H H H H
charge: 0
multiplicity: 1
keywords: wb97x-d3
keywords: def2-TZVPP
keywords: def2/J RIJCOSX
keywords: DEFGRID2
keywords: scfconv7
keywords: smallprint printgap noloewdin
keywords: NOSOSCF
formula: C8H19O2PS2
InChI: InChI=1/C8H19O2PS2/c1-4-7-12-11(9,10-6-3)13-8-5-2/h4-8H2,1-3H3
32 atoms
S  1.572833 1.100893 0.753349
S  -1.662218 0.662191 1.204467
P  -0.037131 -0.043605 0.104851
O  0.197541 -1.451843 0.835768
O  -0.218609 -0.055278 -1.365517
C  2.607874 1.178284 -0.75732
C  -2.317018 1.944052 0.07116
C  3.716281 0.14142 -0.820151
C  -3.645502 1.539321 -0.549775
C  3.228632 -1.292538 -0.940591
C  -3.570085 0.330165 -1.467015
C  -0.678855 -2.558772 0.568524
C  -0.247371 -3.344488 -0.649227
H  3.02677 2.185156 -0.738323
H  1.948065 1.115283 -1.622665
H  -1.572367 2.151159 -0.697322
H  -2.427565 2.845979 0.672341
H  4.333717 0.391734 -1.688524
H  4.363998 0.244269 0.053451
H  -4.376537 1.362175 0.243045
H  -4.01291 2.40413 -1.110766
H  2.54045 -1.409537 -1.778992
H  2.712109 -1.614487 -0.037352
H  4.066781 -1.971589 -1.098307
H  -2.845854 0.477531 -2.266912
H  -4.542033 0.132831 -1.918755
H  -3.271992 -0.564391 -0.921044
H  -1.709777 -2.208559 0.461063
H  -0.640232 -3.17626 1.465567
H  -0.894245 -4.214836 -0.766137
H  -0.318603 -2.744809 -1.554869
H  0.77734 -3.701182 -0.547792
totalener: -1604.67059570 hartree
nucrepener: 1306.54797833 hartree
electener: -2911.21857402 hartree
oneelecener: -4806.86156997 hartree
twoeener: 1895.64299595 hartree
kineticenergy: 1600.34774084 hartree
xcener: -101.619039505139 hartree
chargesum: -0.0000000
charge: -0.151093 -0.181349 0.692498 -0.331097 -0.533941 -0.127006 -0.093911 -0.088758 -0.103743 -0.260207 -0.239001 0.034458 -0.254440 0.113366 0.117115 0.096021 0.113201 0.064965 0.061956 0.062439 0.065817 0.087829 0.075301 0.089005 0.092177 0.087220 0.064122 0.074993 0.099664 0.088444 0.100302 0.083655
qa: -0.1511 -0.1813 0.6925 -0.3311 -0.5339 -0.1270 -0.0939 -0.0888 -0.1037 -0.2602 -0.2390 0.0345 -0.2544 0.1134 0.1171 0.0960 0.1132 0.0650 0.0620 0.0624 0.0658 0.0878 0.0753 0.0890 0.0922 0.0872 0.0641 0.0750 0.0997 0.0884 0.1003 0.0837
va: 2.2992 2.2801 5.4075 2.0891 2.0448 3.9017 3.8841 3.8944 3.9177 3.9282 3.9420 3.8993 3.9149 1.0043 1.0334 1.0339 1.0094 1.0094 1.0121 1.0106 1.0093 1.0043 1.0202 1.0082 1.0100 1.0071 1.0103 1.0060 0.9923 1.0131 1.0193 1.0019
dispcorr: -0.015036110 hartree
energy: -1604.685631808863
dipole: -1.36907 1.28010 -0.08896 -7.67227 7.60556 -0.06671 -12.38638 12.25802 -0.12836
magnitude: 0.16983 au
magnitude: 0.43166 debye
