program: Gaussian 09
title: 000065626
version: EM64L-G09RevD.01
frameworkgroup: C1[X(C4H10O6S4)]
method: RPBEPBE
basis: SDD
operation: Freq
keyword: #p
keyword: freq=noraman
keyword: PBEPBE/SDD
title: #p freq=noraman PBEPBE/SDD
converged: YES YES NO NO
title: Mulliken charges:
elementType: S S S S O O O O O O C C C C H H H H H H H H H H
charge: 1.040590 1.040230 0.081430 0.081618 -0.570708 -0.570079 -0.508172 -0.511599 -0.509712 -0.510726 -0.486049 -0.485680 -0.658467 -0.657711 0.305846 0.303430 0.304829 0.304001 0.315878 0.302634 0.314045 0.303547 0.385392 0.385435
chargesum: 0.00000
title: Mulliken charges with hydrogens summed into heavy atoms:
elementType: S S S S O O O O O O C C C C
charge: 1.040590 1.040230 0.081430 0.081618 -0.185317 -0.184644 -0.508172 -0.511599 -0.509712 -0.510726 0.123227 0.123150 -0.039955 -0.040119
polarizability: 2.25467054e+02 -1.75429491e-01 1.31706137e+02 -6.85804382e+00 1.30597493e-01 1.39159440e+02
1716.lowfreq: -5.2389 -1.6575 0.0016 0.0019 0.0020 4.6501 6.8171 15.7786 17.5533
frequency: 1.4593 15.4766 17.4310 43.6377 47.5310 63.2090 68.0356 103.5052 113.2597 140.0140 174.1913 175.3292 187.2111 222.1153 226.4247 239.5463 241.2372 263.5703 268.1722 296.8005 298.0650 327.6790 328.3713 379.4137 382.8567 410.2314 535.0600 536.7680 573.9674 574.4163 666.9232 668.7200 772.8966 774.2002 843.6915 844.4458 921.0005 923.2562 995.4044 998.8287 1025.7442 1026.4056 1066.4265 1067.9291 1123.7205 1124.2548 1233.0989 1237.0829 1263.7757 1264.6086 1282.7303 1291.7233 1411.2911 1412.2424 1440.6733 1442.4275 3031.3149 3032.4443 3067.6754 3068.1545 3109.6023 3111.1109 3166.5421 3167.0024 3499.4010 3499.5441
redmass: 11.8815 11.9793 13.5501 6.6989 6.5134 3.8828 5.2709 8.1150 9.4577 2.4190 1.5895 1.5636 7.4010 5.1656 2.6647 2.8182 3.2683 3.6369 5.7528 5.6142 5.6383 10.7115 10.6666 9.5068 9.6883 18.5642 15.2538 14.7570 7.2960 7.4454 5.4507 5.5646 1.1662 1.1685 12.5640 12.4424 2.5710 2.7065 2.3740 2.3325 1.3899 1.3955 2.7317 2.7313 1.1073 1.1080 1.1586 1.1623 1.1671 1.1682 1.1995 1.1914 1.1027 1.1030 1.0965 1.0954 1.0585 1.0588 1.0562 1.0562 1.1070 1.1066 1.1114 1.1114 1.0665 1.0665
irintensity: 0.0435 0.0613 0.1524 1.8557 0.2732 2.8383 0.4019 12.1503 0.3301 0.0028 24.4484 71.1691 4.8410 2.0386 45.3544 24.5018 51.9058 46.6456 2.9033 19.6049 72.1848 4.2059 4.2094 87.0338 37.5078 0.5177 246.7154 23.2848 57.2435 6.5396 1.5266 13.6822 6.5494 3.0051 11.0629 83.7355 12.2969 101.0443 3.3920 68.7302 56.2309 49.0072 7.9003 26.2083 13.0616 19.0176 10.3421 12.6250 0.3018 0.4744 2.3657 1.4106 13.2231 12.4869 18.3302 8.0130 2.4208 10.6206 6.7500 6.5642 2.4647 1.1144 1.7301 0.9596 99.1451 25.8255
temp: 298.150 k
press: 1.00000 atm
elementType: 16 16 16 16 8 8 8 8 8 8 6 6 6 6 1 1 1 1 1 1 1 1 1 1
symmnumber: 1
zpe: 401534.2 jmol-1
zpe.correction: 0.152936 hartree
zpe.thermalcorrener: 0.173005 hartree
zpe.thermalcorrenthalpy: 0.173949 hartree
zpe.thermalcorrgfe: 0.097000 hartree
zpe.sumelectzpe: -2200.512801 hartree
zpe.sumelectthermal: -2200.492732 hartree
zpe.sumelectthermalent: -2200.491788 hartree
zpe.sumelectthermalfe: -2200.568737 hartree
dipole: -0.0226 -3.8704 0.1220
dipole: 3.8724
quadrupole: -114.8468 -129.1440 -119.5568
quadrupole: 0.5203 11.2739 0.4068
quadrupole: 6.3357 -7.9615 1.6257 0.5203 11.2739 0.4068
hfenergy: -2200.6657374 hartree
pointgroup: C01 [X(C4H10O6S4)]
dipole: 0.0084124 0.6740018 -1.3662838 debye
dipolederiv: 1.6685954 -0.0885543 0.0471218 -0.1146523 1.3878514 -0.0054111 -0.0691992 -0.044215 1.2975853 1.663438 -0.0294843 -0.0890969 -0.1458282 1.3149595 0.0271848 -0.0355663 0.068008 1.3819774 -0.2861052 0.0817127 0.071993 0.1874967 -0.028379 0.0032873 -0.0021971 0.0308923 0.020181 -0.2831108 0.1140098 0.0202842 0.1120167 0.0153554 -0.0037934 0.1480995 -0.0333941 -0.0258878 -1.0622368 0.2763903 -0.1603493 0.3821959 -0.6960856 -0.0345389 -0.1523865 -0.0184334 -0.4363535 -1.0387495 0.0770438 0.3064019 0.1610646 -0.582226 -0.1423912 0.386881 -0.1655269 -0.5696481 -0.5968221 -0.0183694 -0.0180113 -0.0703301 -0.468085 -0.0556726 0.1538777 0.0095802 -0.6849915 -0.6449965 -0.080212 0.0393834 -0.1400326 -0.6418021 0.0145282 0.1098841 -0.0553198 -0.5135766 -0.6036014 -0.0326229 0.0052532 0.0670977 -0.6150389 0.1340805 -0.1425049 0.0749577 -0.5337496 -0.6483293 -0.02491 -0.0972423 -0.01171 -0.5804831 -0.0960911 -0.1850939 -0.0219991 -0.570853 0.3766774 0.0283968 -0.1462229 -0.0855743 -0.0989992 0.0150278 -0.2290788 0.0048259 0.0434361 0.3578418 -0.1099697 0.1130023 -0.2392418 0.0113514 -0.0733404 0.0678822 -0.0641087 -0.0555508 0.1736609 0.0076691 -0.0663722 -0.2560038 -0.0438379 0.0440888 0.0814541 -0.0096881 -0.0329285 0.1708519 -0.053974 0.0506353 -0.0907591 -0.0164491 -0.0250702 -0.2491534 0.0358295 -0.0582554 -0.0060438 -0.0013019 0.0379143 -0.0273901 0.0879125 0.0044186 -0.0288815 0.0041127 0.0236432 0.0849347 -0.0568633 0.0288047 0.0285122 0.0292446 -0.0304581 0.0544289 -0.0017732 0.0391345 -0.0072531 0.0304343 -0.024871 -0.0396295 0.0494613 0.0325263 -0.0056334 0.034107 0.0587292 0.0909579 -0.0107498 -0.060641 0.0598184 0.0193501 0.0070127 -0.0076373 -0.0231184 0.0483851 0.0337823 -0.0758974 0.0043967 0.0470151 0.046821 -0.0293462 0.058344 0.0031422 0.0966682 0.0105007 -0.0078433 -0.0025205 0.0325171 0.0935382 -0.011928 -0.0355862 0.038709 -0.0340484 0.030915 -0.0410532 -0.0658492 0.0738779 0.0634308 -0.012212 -0.0017588 -0.0459732 0.0744144 0.0124766 -0.006019 -0.0054665 -0.0128094 0.0261307 0.0893002 0.0476388 0.0379435 0.0369569 0.2485626 -0.0514547 0.1330806 0.0288663 0.299183 0.0678522 0.0349915 0.1045683 0.2138358 0.2540532 0.0736225 -0.1216283 0.0534825 0.3267961 0.0809457 0.0011954 0.0368736 0.1808963 unknown
polarizability: 225.2834162|6.5590873|137.6866788|4.4642315|3.1386929|133.3625356 unknown
InChI: InChI=1S/C4H10O6S4/c5-13(6,7)3-1-11-12-2-4-14(8,9)10/h5,8H,1-4H2
charge 0 multiplicity 1
24 atoms
S  -4.281603 -0.217048 0.450344
S  4.168954 -0.206312 0.559462
S  -0.407164 -0.133542 -1.9707
S  0.355858 1.77422 -0.996419
O  -5.50579 1.019238 -0.217705
O  5.349229 -0.577037 -0.833859
O  -3.860401 0.176521 1.962016
O  -4.768248 -1.725916 0.12643
O  3.632662 -1.582039 1.221092
O  4.769914 0.954548 1.512937
C  -2.914441 0.320741 -0.816426
C  2.841409 0.537375 -0.643148
C  -1.744504 -0.644374 -0.720465
C  1.669534 1.054749 0.17429
H  -3.444829 0.293307 -1.779502
H  -2.676753 1.349756 -0.505079
H  3.400188 1.317221 -1.180834
H  2.591796 -0.315067 -1.293827
H  -2.021385 -1.669725 -1.024111
H  -1.294689 -0.672106 0.284563
H  1.950592 1.905893 0.819874
H  1.201903 0.269968 0.789822
H  -6.337158 0.971276 0.336154
H  6.161326 -1.017747 -0.451108
