program: Orca
programVersion: 5.0.2
elementType: S S P O O C C C C C C C C H H H H H H H H H H H H H H H H H H H
charge: 0
multiplicity: 1
keywords: wb97x-d3
keywords: def2-TZVPP
keywords: def2/J RIJCOSX
keywords: DEFGRID2
keywords: scfconv7
keywords: smallprint printgap noloewdin
keywords: NOSOSCF
formula: C8H19O2PS2
InChI: InChI=1/C8H19O2PS2/c1-4-7-12-11(9,10-6-3)13-8-5-2/h4-8H2,1-3H3
32 atoms
S  1.636955 -0.38171 1.136612
S  -1.057948 1.404657 0.916773
P  -0.100549 -0.205604 0.008707
O  -0.880118 -1.514995 0.51302
O  0.042919 -0.062858 -1.457369
C  2.556097 1.098416 0.564125
C  -1.964905 2.149117 -0.490464
C  3.764049 0.746877 -0.291485
C  -3.411407 1.700434 -0.610581
C  3.426348 0.055685 -1.602372
C  -3.581225 0.22181 -0.917306
C  -0.917085 -2.697899 -0.300149
C  0.413564 -3.415343 -0.358995
H  2.859683 1.628643 1.466883
H  1.868479 1.754101 0.02676
H  -1.403012 1.94409 -1.401544
H  -1.910117 3.222781 -0.30652
H  4.294972 1.682282 -0.493249
H  4.452757 0.129469 0.2907
H  -3.951806 1.956738 0.303564
H  -3.863689 2.295698 -1.409907
H  2.948529 -0.90841 -1.43209
H  4.330272 -0.118975 -2.185591
H  2.742005 0.650893 -2.206247
H  -4.627648 -0.014815 -1.108665
H  -3.254504 -0.395775 -0.081282
H  -3.005339 -0.069032 -1.797154
H  -1.263946 -2.444795 -1.303945
H  -1.673354 -3.328195 0.16647
H  0.290189 -4.358515 -0.892343
H  1.165486 -2.831708 -0.889312
H  0.791552 -3.638995 0.638175
totalener: -1604.66994999 hartree
nucrepener: 1310.58594183 hartree
electener: -2915.25589182 hartree
oneelecener: -4814.94306665 hartree
twoeener: 1899.68717483 hartree
kineticenergy: 1600.35120413 hartree
xcener: -101.620853017181 hartree
chargesum: -0.0000000
charge: -0.168198 -0.160916 0.691005 -0.345985 -0.527460 -0.099061 -0.125532 -0.102714 -0.089474 -0.234963 -0.264436 0.034456 -0.264268 0.116433 0.087619 0.118186 0.112870 0.065562 0.063633 0.063400 0.065966 0.068792 0.086739 0.086331 0.089949 0.081586 0.084066 0.094183 0.096510 0.087405 0.095796 0.092522
qa: -0.1682 -0.1609 0.6910 -0.3460 -0.5275 -0.0991 -0.1255 -0.1027 -0.0895 -0.2350 -0.2644 0.0345 -0.2643 0.1164 0.0876 0.1182 0.1129 0.0656 0.0636 0.0634 0.0660 0.0688 0.0867 0.0863 0.0899 0.0816 0.0841 0.0942 0.0965 0.0874 0.0958 0.0925
va: 2.2903 2.2973 5.4191 2.0807 2.0556 3.9016 3.8924 3.9152 3.8886 3.9390 3.9292 3.8737 3.9418 1.0084 1.0337 1.0338 1.0047 1.0088 1.0100 1.0123 1.0095 1.0131 1.0061 1.0107 1.0092 1.0140 1.0080 1.0000 0.9878 1.0141 1.0015 1.0023
dispcorr: -0.015043139 hartree
energy: -1604.684993131783
dipole: 0.36432 -0.43306 -0.06874 -2.30239 2.38353 0.08115 -11.22918 11.14984 -0.07935
magnitude: 0.13269 au
magnitude: 0.33727 debye
