program: Orca
programVersion: 5.0.2
elementType: S S P O O C C C C C C C C H H H H H H H H H H H H H H H H H H H
charge: 0
multiplicity: 1
keywords: wb97x-d3
keywords: def2-TZVPP
keywords: def2/J RIJCOSX
keywords: DEFGRID2
keywords: scfconv7
keywords: smallprint printgap noloewdin
keywords: NOSOSCF
formula: C8H19O2PS2
InChI: InChI=1/C8H19O2PS2/c1-4-7-12-11(9,10-6-3)13-8-5-2/h4-8H2,1-3H3
32 atoms
S  1.717846 -0.452546 0.38456
S  -0.90176 1.455406 0.679403
P  -0.247493 -0.281016 -0.271589
O  -0.930913 -1.480592 0.546405
O  -0.458454 -0.284621 -1.736964
C  2.460719 0.889885 -0.615541
C  -2.065839 2.143035 -0.555596
C  3.970469 0.904366 -0.426443
C  -3.519834 1.782468 -0.304181
C  4.417158 1.224209 0.992186
C  -3.82334 0.298368 -0.425076
C  -1.211284 -2.73769 -0.087057
C  0.029283 -3.580033 -0.284526
H  2.019317 1.837335 -0.301645
H  2.202802 0.717634 -1.659621
H  -1.736462 1.825717 -1.544923
H  -1.920167 3.222091 -0.492044
H  4.388155 -0.052413 -0.748342
H  4.369986 1.655951 -1.112522
H  -3.821082 2.14601 0.680974
H  -4.117227 2.340462 -1.031709
H  5.503554 1.285001 1.052168
H  4.092353 0.464396 1.703354
H  4.012671 2.180266 1.327121
H  -3.340237 -0.269825 0.369157
H  -3.480565 -0.099535 -1.381206
H  -4.895167 0.11639 -0.350637
H  -1.719874 -2.567574 -1.037882
H  -1.912082 -3.23482 0.582916
H  0.567925 -3.720577 0.652107
H  -0.25686 -4.563342 -0.659177
H  0.710156 -3.133793 -1.008498
totalener: -1604.67090882 hartree
nucrepener: 1289.68816651 hartree
electener: -2894.35907533 hartree
oneelecener: -4773.08894244 hartree
twoeener: 1878.72986711 hartree
kineticenergy: 1600.34836424 hartree
xcener: -101.620162502659 hartree
chargesum: -0.0000000
charge: -0.172247 -0.165078 0.705142 -0.345140 -0.530810 -0.110910 -0.121279 -0.127286 -0.087617 -0.232317 -0.262881 0.032971 -0.257892 0.095666 0.127347 0.117839 0.111525 0.071502 0.071132 0.062401 0.065367 0.085302 0.079674 0.075082 0.078839 0.084990 0.089967 0.094868 0.094152 0.090097 0.086109 0.093484
qa: -0.1722 -0.1651 0.7051 -0.3451 -0.5308 -0.1109 -0.1213 -0.1273 -0.0876 -0.2323 -0.2629 0.0330 -0.2579 0.0957 0.1273 0.1178 0.1115 0.0715 0.0711 0.0624 0.0654 0.0853 0.0797 0.0751 0.0788 0.0850 0.0900 0.0949 0.0942 0.0901 0.0861 0.0935
va: 2.3097 2.2866 5.4046 2.0856 2.0672 3.9118 3.8885 3.9357 3.8860 3.9318 3.9286 3.8813 3.9262 1.0178 1.0151 1.0351 1.0054 1.0137 1.0052 1.0126 1.0098 1.0057 1.0099 1.0042 1.0149 1.0087 1.0088 1.0014 0.9870 1.0028 1.0133 1.0157
dispcorr: -0.013721017 hartree
energy: -1604.684629835055
dipole: 0.80062 -0.77292 0.02770 -0.11465 0.22020 0.10555 -3.14512 3.14248 -0.00264
magnitude: 0.10916 au
magnitude: 0.27746 debye
