program: Orca
programVersion: 5.0.2
elementType: S S P O O C C C C C C C C H H H H H H H H H H H H H H H H H H H
charge: 0
multiplicity: 1
keywords: wb97x-d3
keywords: def2-TZVPP
keywords: def2/J RIJCOSX
keywords: DEFGRID2
keywords: scfconv7
keywords: smallprint printgap noloewdin
keywords: NOSOSCF
formula: C8H19O2PS2
InChI: InChI=1/C8H19O2PS2/c1-4-7-12-11(9,10-6-3)13-8-5-2/h4-8H2,1-3H3
32 atoms
S  1.347704 1.16569 0.600013
S  -1.692526 0.193753 1.241969
P  -0.059897 -0.247772 0.031363
O  0.456049 -1.600961 0.722377
O  -0.30922 -0.303174 -1.427161
C  2.395457 1.178599 -0.90232
C  -2.359902 1.629267 0.324922
C  3.272718 -0.049914 -1.072086
C  -3.260953 1.248475 -0.836345
C  4.225596 -0.295152 0.085816
C  -3.827143 2.484636 -1.522168
C  -0.201911 -2.841888 0.417973
C  0.460969 -3.547713 -0.742416
H  3.004237 2.077902 -0.787685
H  1.746368 1.325408 -1.764209
H  -1.524121 2.253043 0.000679
H  -2.90705 2.203483 1.074795
H  2.643218 -0.926404 -1.23734
H  3.840911 0.088003 -1.996609
H  -2.694724 0.650024 -1.549727
H  -4.074012 0.618536 -0.469191
H  4.871996 -1.148727 -0.117028
H  3.684548 -0.500204 1.008991
H  4.868154 0.569674 0.261286
H  -3.032548 3.112898 -1.927417
H  -4.412968 3.0956 -0.833241
H  -4.478885 2.207473 -2.350416
H  -1.264355 -2.675776 0.216265
H  -0.135439 -3.436715 1.328979
H  1.516832 -3.728003 -0.541767
H  -0.017887 -4.513751 -0.905972
H  0.371996 -2.966168 -1.658448
totalener: -1604.67351124 hartree
nucrepener: 1290.80968386 hartree
electener: -2895.48319510 hartree
oneelecener: -4775.28972276 hartree
twoeener: 1879.80652766 hartree
kineticenergy: 1600.35806944 hartree
xcener: -101.619356591145 hartree
chargesum: -0.0000000
charge: -0.154398 -0.172581 0.672903 -0.334440 -0.530928 -0.131314 -0.097417 -0.093027 -0.094491 -0.243012 -0.253481 0.041585 -0.259465 0.111545 0.128136 0.097093 0.111803 0.061177 0.070617 0.083778 0.056721 0.084020 0.087048 0.072111 0.079770 0.071616 0.087678 0.080265 0.095615 0.083378 0.087832 0.099864
qa: -0.1544 -0.1726 0.6729 -0.3344 -0.5309 -0.1313 -0.0974 -0.0930 -0.0945 -0.2430 -0.2535 0.0416 -0.2595 0.1115 0.1281 0.0971 0.1118 0.0612 0.0706 0.0838 0.0567 0.0840 0.0870 0.0721 0.0798 0.0716 0.0877 0.0803 0.0956 0.0834 0.0878 0.0999
va: 2.2887 2.2978 5.4228 2.0848 2.0605 3.9108 3.8890 3.8837 3.8830 3.9325 3.9541 3.8881 3.9221 1.0035 1.0275 1.0306 1.0055 1.0204 1.0107 1.0326 1.0149 1.0068 1.0137 1.0040 1.0030 1.0025 1.0064 1.0087 0.9911 1.0023 1.0131 1.0180
dispcorr: -0.013702417 hartree
energy: -1604.687213656364
dipole: 1.95301 -1.89617 0.05684 -1.53357 1.44105 -0.09252 -10.56401 10.50316 -0.06085
magnitude: 0.12447 au
magnitude: 0.31638 debye
