program: Orca
programVersion: 5.0.2
elementType: S S P O O C C C C C C C C H H H H H H H H H H H H H H H H H H H
charge: 0
multiplicity: 1
keywords: wb97x-d3
keywords: def2-TZVPP
keywords: def2/J RIJCOSX
keywords: DEFGRID2
keywords: scfconv7
keywords: smallprint printgap noloewdin
keywords: NOSOSCF
formula: C8H19O2PS2
InChI: InChI=1/C8H19O2PS2/c1-4-7-12-11(9,10-6-3)13-8-5-2/h4-8H2,1-3H3
32 atoms
S  2.072155 -0.725324 0.324049
S  -0.580279 0.996951 1.17177
P  0.045369 -0.519681 -0.09744
O  -0.578763 -1.816264 0.614832
O  -0.26756 -0.350719 -1.53462
C  2.772414 0.330983 -0.997525
C  -2.343288 1.098899 0.680824
C  2.593539 1.823042 -0.77313
C  -2.587686 1.957129 -0.547441
C  3.197703 2.330953 0.525448
C  -4.070541 2.019536 -0.889168
C  -0.530442 -3.078322 -0.070571
C  -1.790097 -3.320023 -0.868947
H  2.337477 0.01578 -1.944452
H  3.831111 0.064374 -1.012135
H  -2.846573 1.512831 1.556661
H  -2.729864 0.086908 0.549229
H  3.059937 2.331151 -1.622286
H  1.532029 2.074947 -0.818236
H  -2.201758 2.962393 -0.365456
H  -2.025543 1.552065 -1.388728
H  4.26133 2.094239 0.589814
H  2.70709 1.889755 1.392638
H  3.094405 3.412616 0.604389
H  -4.469875 1.027745 -1.106503
H  -4.242471 2.640195 -1.768089
H  -4.656727 2.439684 -0.070199
H  -0.410685 -3.828927 0.710631
H  0.353639 -3.134795 -0.712305
H  -1.89883 -2.58313 -1.663116
H  -1.750503 -4.308523 -1.327632
H  -2.673356 -3.28358 -0.23158
totalener: -1604.67295511 hartree
nucrepener: 1294.19642264 hartree
electener: -2898.86937774 hartree
oneelecener: -4782.08012274 hartree
twoeener: 1883.21074500 hartree
kineticenergy: 1600.35889944 hartree
xcener: -101.619353729945 hartree
chargesum: -0.0000000
charge: -0.175115 -0.155506 0.680347 -0.340941 -0.530070 -0.116833 -0.092047 -0.125294 -0.096433 -0.231460 -0.253639 0.038914 -0.251809 0.129336 0.109705 0.113530 0.095377 0.072669 0.071349 0.057323 0.084524 0.074382 0.078484 0.085883 0.078037 0.088810 0.072532 0.095370 0.080005 0.098547 0.083283 0.080742
qa: -0.1751 -0.1555 0.6803 -0.3409 -0.5301 -0.1168 -0.0920 -0.1253 -0.0964 -0.2315 -0.2536 0.0389 -0.2518 0.1293 0.1097 0.1135 0.0954 0.0727 0.0713 0.0573 0.0845 0.0744 0.0785 0.0859 0.0780 0.0888 0.0725 0.0954 0.0800 0.0985 0.0833 0.0807
va: 2.2899 2.2829 5.4203 2.0944 2.0608 3.8855 3.9143 3.8976 3.8821 3.9249 3.9591 3.9000 3.9277 1.0278 1.0030 1.0053 1.0239 1.0111 1.0234 1.0144 1.0303 1.0042 1.0146 1.0073 1.0032 1.0063 1.0024 0.9911 1.0088 1.0186 1.0122 1.0034
dispcorr: -0.013827912 hartree
energy: -1604.686783018078
dipole: -7.85078 7.68555 -0.16524 6.75409 -6.87427 -0.12017 -7.10174 7.09871 -0.00303
magnitude: 0.20434 au
magnitude: 0.51939 debye
