program: Orca
programVersion: 5.0.2
elementType: S S P O O C C C C C C C C H H H H H H H H H H H H H H H H H H H
charge: 0
multiplicity: 1
keywords: wb97x-d3
keywords: def2-TZVPP
keywords: def2/J RIJCOSX
keywords: DEFGRID2
keywords: scfconv7
keywords: smallprint printgap noloewdin
keywords: NOSOSCF
formula: C8H19O2PS2
InChI: InChI=1/C8H19O2PS2/c1-4-7-12-11(9,10-6-3)13-8-5-2/h4-8H2,1-3H3
32 atoms
S  0.941317 0.911579 1.269482
S  -2.153039 -0.213408 0.700912
P  -0.171299 -0.35334 0.048394
O  0.258863 -1.792849 0.616244
O  0.006275 -0.126402 -1.404606
C  2.322044 1.277883 0.126579
C  -2.954334 0.651113 -0.703445
C  3.318283 0.143663 -0.034677
C  -3.119295 2.148132 -0.508862
C  4.478689 0.55254 -0.93236
C  -1.812225 2.922358 -0.493347
C  -0.24154 -2.983322 -0.009422
C  0.691813 -3.471215 -1.094337
H  2.799751 2.155383 0.567223
H  1.901417 1.580944 -0.831771
H  -3.926762 0.165739 -0.792862
H  -2.389655 0.423533 -1.606997
H  3.686615 -0.159083 0.947357
H  2.815415 -0.726546 -0.459869
H  -3.747544 2.506052 -1.330684
H  -3.680901 2.339442 0.408447
H  5.018555 1.408501 -0.524198
H  4.131626 0.824963 -1.92979
H  5.193122 -0.262525 -1.043962
H  -1.199977 2.659768 0.369136
H  -1.999903 3.9950 -0.447416
H  -1.222752 2.722861 -1.389172
H  -1.247767 -2.814779 -0.404833
H  -0.32984 -3.718106 0.790946
H  0.767311 -2.747058 -1.903975
H  1.69021 -3.659605 -0.700419
H  0.314587 -4.406293 -1.509572
totalener: -1604.67159638 hartree
nucrepener: 1296.35093776 hartree
electener: -2901.02253414 hartree
oneelecener: -4786.43760463 hartree
twoeener: 1885.41507049 hartree
kineticenergy: 1600.35004141 hartree
xcener: -101.617224417277 hartree
chargesum: -0.0000000
charge: -0.150041 -0.184803 0.686016 -0.330060 -0.537281 -0.109696 -0.119463 -0.071226 -0.086632 -0.255404 -0.254519 0.041877 -0.258798 0.109668 0.114684 0.113181 0.116962 0.063157 0.056680 0.064619 0.061875 0.074371 0.083729 0.086401 0.073154 0.088302 0.085931 0.072773 0.095034 0.098444 0.083844 0.087220
qa: -0.1500 -0.1848 0.6860 -0.3301 -0.5373 -0.1097 -0.1195 -0.0712 -0.0866 -0.2554 -0.2545 0.0419 -0.2588 0.1097 0.1147 0.1132 0.1170 0.0632 0.0567 0.0646 0.0619 0.0744 0.0837 0.0864 0.0732 0.0883 0.0859 0.0728 0.0950 0.0984 0.0838 0.0872
va: 2.2831 2.2783 5.3933 2.1009 2.0474 3.9097 3.8885 3.8952 3.8917 3.9539 3.9229 3.9056 3.9189 1.0060 1.0264 1.0043 1.0341 1.0172 1.0215 1.0090 1.0120 1.0035 1.0023 1.0060 1.0289 1.0090 1.0078 1.0136 0.9904 1.0181 1.0032 1.0124
dispcorr: -0.014221694 hartree
energy: -1604.685818075828
dipole: 8.16847 -8.19641 -0.02793 2.55705 -2.77507 -0.21802 -10.91941 10.72293 -0.19647
magnitude: 0.29481 au
magnitude: 0.74935 debye
