program: Orca
programVersion: 5.0.2
elementType: S S P O O C C C C C C C C H H H H H H H H H H H H H H H H H H H
charge: 0
multiplicity: 1
keywords: wb97x-d3
keywords: def2-TZVPP
keywords: def2/J RIJCOSX
keywords: DEFGRID2
keywords: scfconv7
keywords: smallprint printgap noloewdin
keywords: NOSOSCF
formula: C8H19O2PS2
InChI: InChI=1/C8H19O2PS2/c1-4-7-12-11(9,10-6-3)13-8-5-2/h4-8H2,1-3H3
32 atoms
S  1.449901 -0.317599 1.223917
S  -0.618841 0.781776 -1.27265
P  0.380627 -0.871334 -0.4729
O  -0.719634 -1.747853 0.298454
O  1.141054 -1.501511 -1.570233
C  2.989308 0.265164 0.419182
C  -1.405734 1.554253 0.182618
C  2.90473 1.6330 -0.23738
C  -2.791919 1.020031 0.499811
C  2.508127 2.754083 0.708349
C  -3.422714 1.768606 1.666417
C  -1.672131 -2.509908 -0.460592
C  -1.128956 -3.872467 -0.827399
H  3.303721 -0.499441 -0.290138
H  3.714737 0.27354 1.235442
H  -1.450863 2.617969 -0.060479
H  -0.732502 1.456258 1.037462
H  3.892299 1.84093 -0.659807
H  2.217292 1.595094 -1.08403
H  -3.424736 1.105261 -0.386077
H  -2.727929 -0.042014 0.738566
H  2.521593 3.715883 0.196442
H  3.190419 2.822191 1.557805
H  1.503645 2.606272 1.104898
H  -4.417187 1.381865 1.88764
H  -3.525325 2.83332 1.450788
H  -2.823433 1.671333 2.572901
H  -1.978778 -1.953228 -1.351533
H  -2.548004 -2.599163 0.181956
H  -1.90627 -4.452048 -1.32624
H  -0.278151 -3.792503 -1.501106
H  -0.818571 -4.422362 0.06032
totalener: -1604.67155255 hartree
nucrepener: 1303.78588728 hartree
electener: -2908.45743983 hartree
oneelecener: -4800.95849709 hartree
twoeener: 1892.50105726 hartree
kineticenergy: 1600.35122068 hartree
xcener: -101.619781047283 hartree
chargesum: -0.0000000
charge: -0.161666 -0.156603 0.685825 -0.336413 -0.522782 -0.126236 -0.110390 -0.135759 -0.092091 -0.238244 -0.252953 0.012457 -0.237330 0.134117 0.110835 0.114911 0.088859 0.073703 0.085543 0.068339 0.063325 0.089282 0.078931 0.071133 0.088104 0.077689 0.081279 0.091452 0.091669 0.078341 0.100932 0.083741
qa: -0.1617 -0.1566 0.6858 -0.3364 -0.5228 -0.1262 -0.1104 -0.1358 -0.0921 -0.2382 -0.2530 0.0125 -0.2373 0.1341 0.1108 0.1149 0.0889 0.0737 0.0855 0.0683 0.0633 0.0893 0.0789 0.0711 0.0881 0.0777 0.0813 0.0915 0.0917 0.0783 0.1009 0.0837
va: 2.2839 2.2788 5.4188 2.0874 2.1135 3.8853 3.8700 3.8932 3.9088 3.9274 3.9622 3.8933 3.9579 1.0250 1.0038 1.0066 1.0378 1.0110 1.0205 1.0133 1.0154 1.0072 1.0048 1.0090 1.0065 1.0039 1.0015 1.0020 0.9839 1.0086 1.0218 1.0053
dispcorr: -0.014788915 hartree
energy: -1604.686341463535
dipole: -7.27447 6.58170 -0.69277 8.34413 -7.75262 0.59151 5.97649 -5.27339 0.70310
magnitude: 1.15072 au
magnitude: 2.92489 debye
