program: Orca
programVersion: 5.0.2
elementType: S S P O O C C C C C C C C H H H H H H H H H H H H H H H H H H H
charge: 0
multiplicity: 1
keywords: wb97x-d3
keywords: def2-TZVPP
keywords: def2/J RIJCOSX
keywords: DEFGRID2
keywords: scfconv7
keywords: smallprint printgap noloewdin
keywords: NOSOSCF
formula: C8H19O2PS2
InChI: InChI=1/C8H19O2PS2/c1-4-7-12-11(9,10-6-3)13-8-5-2/h4-8H2,1-3H3
32 atoms
S  1.670447 -0.344925 1.155215
S  -0.738267 0.959235 -0.893681
P  0.353802 -0.755524 -0.40258
O  -0.636734 -1.706622 0.427209
O  0.958395 -1.273284 -1.645608
C  3.104969 0.21068 0.15811
C  -1.301102 1.58848 0.72713
C  2.965239 1.582117 -0.480678
C  -2.631069 1.026306 1.200395
C  2.703139 2.706231 0.506879
C  -3.791082 1.318791 0.262663
C  -1.73724 -2.342091 -0.242889
C  -1.326241 -3.652203 -0.875882
H  3.304352 -0.556262 -0.588674
H  3.929812 0.198867 0.873224
H  -1.370888 2.669299 0.588213
H  -0.508224 1.414469 1.45689
H  3.898146 1.774384 -1.018654
H  2.181285 1.558929 -1.23908
H  -2.537332 -0.04749 1.367822
H  -2.83501 1.465621 2.181506
H  3.481549 2.758412 1.270152
H  1.749222 2.573178 1.017371
H  2.672961 3.669489 -0.001399
H  -3.920779 2.392415 0.115468
H  -4.726075 0.927018 0.662506
H  -3.634798 0.868775 -0.718188
H  -2.169823 -1.665093 -0.986567
H  -2.492151 -2.501369 0.52739
H  -2.203296 -4.140616 -1.30205
H  -0.601357 -3.498232 -1.673025
H  -0.892753 -4.32612 -0.137784
totalener: -1604.67142774 hartree
nucrepener: 1312.07940861 hartree
electener: -2916.75083635 hartree
oneelecener: -4817.57204151 hartree
twoeener: 1900.82120516 hartree
kineticenergy: 1600.35429915 hartree
xcener: -101.621870444844 hartree
chargesum: -0.0000000
charge: -0.165631 -0.161368 0.693407 -0.335707 -0.523516 -0.123891 -0.130249 -0.132665 -0.125163 -0.237826 -0.235781 0.016577 -0.237306 0.133705 0.111585 0.116235 0.108813 0.073592 0.085117 0.070816 0.079212 0.078369 0.069724 0.089719 0.077593 0.086343 0.077099 0.085730 0.092524 0.078445 0.099799 0.084699
qa: -0.1656 -0.1614 0.6934 -0.3357 -0.5235 -0.1239 -0.1302 -0.1327 -0.1252 -0.2378 -0.2358 0.0166 -0.2373 0.1337 0.1116 0.1162 0.1088 0.0736 0.0851 0.0708 0.0792 0.0784 0.0697 0.0897 0.0776 0.0863 0.0771 0.0857 0.0925 0.0784 0.0998 0.0847
va: 2.2829 2.2664 5.4148 2.0913 2.1132 3.8850 3.8747 3.8926 3.9236 3.9300 3.9233 3.8944 3.9654 1.0256 1.0033 1.0044 1.0362 1.0103 1.0196 1.0120 1.0097 1.0050 1.0100 1.0072 1.0041 1.0069 1.0156 1.0014 0.9832 1.0080 1.0216 1.0056
dispcorr: -0.015193893 hartree
energy: -1604.686621632246
dipole: -7.65266 7.05052 -0.60214 6.95868 -6.45960 0.49908 3.00534 -2.20047 0.80487
magnitude: 1.12226 au
magnitude: 2.85256 debye
