program: Gaussian 09
title: 000065627
version: EM64L-G09RevD.01
frameworkgroup: C1[X(C18H16N2O4)]
method: RPBEPBE
basis: SDD
operation: Freq
keyword: #p
keyword: freq=noraman
keyword: PBEPBE/SDD
title: #p freq=noraman PBEPBE/SDD
converged: YES YES NO NO
title: Mulliken charges:
elementType: O O O O N N C C C C C C C C C C C C C C C C C C H H H H H H H H H H H H H H H H
charge: -0.264692 -0.211351 -0.416940 -0.222341 -0.290214 0.008153 0.153011 0.187742 0.190621 0.236189 -0.633200 -0.564051 -0.236334 -0.770982 0.055679 0.314662 -0.381355 0.246018 0.205766 -0.268630 -0.431724 -0.183186 -0.536387 -0.332081 0.244725 0.249214 0.273064 0.254654 0.237197 0.265322 0.249136 0.252370 0.276485 0.288416 0.238213 0.223054 0.220360 0.244677 0.379100 0.249641
chargesum: 0.00000
title: Mulliken charges with hydrogens summed into heavy atoms:
elementType: O O O O N N C C C C C C C C C C C C C C C C C C
charge: -0.264692 -0.211351 -0.037840 -0.222341 -0.290214 0.008153 0.153011 0.187742 0.190621 0.236189 -0.139262 -0.290987 0.018319 -0.019326 0.055679 0.314662 -0.128986 0.246018 0.205766 0.007856 -0.143308 0.055027 0.151704 -0.082440
polarizability: 3.11794033e+02 -1.15586360e+01 2.45534480e+02 -5.43775639e+00 1.89329316e+01 1.46564369e+02
1716.lowfreq: -5.0967 -0.0005 -0.0005 0.0002 1.9730 4.6925 23.0587 29.4914 38.8539
frequency: 23.0023 29.4761 38.8528 42.9232 48.8023 68.8880 82.5745 100.6371 120.9807 143.4536 147.4930 170.6773 176.3035 186.9939 220.3087 224.2371 259.3844 271.7992 308.9867 355.8116 355.8565 376.5835 396.2213 409.1483 411.4610 435.1981 442.0402 466.8193 502.0287 521.2249 549.1765 586.3611 598.4365 610.1977 620.3205 643.5062 658.9312 688.5699 697.2166 715.5493 723.1702 736.2074 757.1963 808.5704 821.6288 832.9243 838.7458 857.9726 895.8660 909.9060 930.5920 942.1070 949.7446 960.5608 993.7892 995.3728 1001.9752 1006.6214 1024.3190 1044.7925 1053.5863 1091.7314 1110.9753 1112.2245 1136.6695 1150.3304 1158.1944 1189.5718 1196.4923 1213.6108 1233.1174 1264.5966 1279.7233 1293.6998 1306.4521 1313.5172 1325.3296 1334.5034 1368.2739 1404.7392 1407.5867 1417.3071 1429.7091 1450.0554 1450.9141 1456.2917 1465.0038 1465.8954 1472.4272 1475.3910 1478.5571 1542.2091 1567.4597 1581.4196 1586.7414 1614.3756 1622.3071 1668.5882 2957.4446 2997.7619 3028.2857 3043.9658 3076.0269 3096.1173 3106.0831 3124.7150 3136.9909 3144.5588 3154.3699 3163.3987 3168.7200 3174.7931 3184.5613 3504.6022
redmass: 7.3337 8.3510 6.7140 6.1023 4.2271 5.1297 4.7986 4.2131 4.8499 3.9692 1.1085 4.6518 3.5717 4.3478 1.9182 3.2915 2.6623 2.9192 4.3396 4.9500 5.8082 4.0649 4.2125 4.9138 2.4776 3.4865 4.6846 4.2604 3.7561 5.4575 4.3866 3.5922 3.2064 6.4234 3.9745 2.4022 3.1409 5.2472 5.9347 5.0855 1.9638 4.9782 4.5786 1.4475 3.2806 2.3182 3.0940 2.2488 3.0262 4.2743 1.3873 1.3305 2.4098 1.7090 3.1142 1.7303 3.2672 2.5229 3.3684 1.5135 2.2676 2.1631 1.6282 1.2624 1.4395 2.3473 1.4558 1.4925 1.4368 2.9554 2.3867 3.9203 1.4762 1.4951 9.2263 2.0275 5.7040 1.2660 4.5200 2.0672 2.5541 1.8689 1.3309 1.1019 1.0996 2.0750 1.1441 1.5547 2.2507 1.0953 1.6906 5.8572 8.3379 6.0451 7.7088 7.9996 6.9803 8.5079 1.0331 1.0372 1.0598 1.1038 1.0968 1.1025 1.0993 1.0993 1.0882 1.0927 1.0915 1.0881 1.0915 1.1003 1.0966 1.0639
irintensity: 1.1856 0.5327 0.9321 1.0691 2.3809 2.0936 1.2762 3.2891 6.2445 0.7403 0.2638 0.9014 1.9266 1.8166 2.4217 2.3009 3.1340 1.4863 9.5841 2.6188 3.9308 2.4322 4.7318 1.5493 1.1449 6.9226 1.3550 3.1057 20.8860 0.7209 43.7975 24.8645 23.0801 11.2589 5.4514 71.6903 36.5449 38.3812 11.1335 1.5861 53.6497 3.7951 0.6443 31.2390 7.3849 37.4903 20.3899 33.5416 8.2418 38.7248 7.2298 0.3060 11.6294 2.2351 10.6322 11.3030 22.1440 65.9014 5.7989 13.1565 218.4702 33.4962 20.9228 0.2130 1.3828 19.0868 6.9109 12.1118 21.9678 150.7073 82.9279 41.3319 42.8034 6.0159 23.9850 46.3197 506.7926 3.5750 64.1286 20.6689 3.8695 17.4574 40.6416 7.7636 37.3354 27.2735 47.0287 159.4243 55.2560 18.4992 5.2097 19.4399 203.9389 39.3792 10.6665 89.7558 56.4664 239.7229 67.9479 15.2057 17.1626 47.4929 8.8353 3.2884 15.2443 29.0275 13.2034 7.7508 8.7350 2.7643 4.1911 19.7712 6.9157 20.4506
temp: 298.150 k
press: 1.00000 atm
elementType: 8 8 8 8 7 7 6 6 6 6 6 6 6 6 6 6 6 6 6 6 6 6 6 6 1 1 1 1 1 1 1 1 1 1 1 1 1 1 1 1
symmnumber: 1
zpe: 798450.3 jmol-1
zpe.correction: 0.304114 hartree
zpe.thermalcorrener: 0.325908 hartree
zpe.thermalcorrenthalpy: 0.326852 hartree
zpe.thermalcorrgfe: 0.251173 hartree
zpe.sumelectzpe: -1104.215393 hartree
zpe.sumelectthermal: -1104.193599 hartree
zpe.sumelectthermalent: -1104.192655 hartree
zpe.sumelectthermalfe: -1104.268333 hartree
dipole: -1.3897 1.5345 -1.1401
dipole: 2.3635
quadrupole: -104.7898 -148.0434 -145.5610
quadrupole: 0.5859 -4.3186 1.7488
quadrupole: 28.0083 -15.2454 -12.7629 0.5859 -4.3186 1.7488
hfenergy: -1104.5195067 hartree
pointgroup: C01 [X(C18H16N2O4)]
dipole: 0.5210503 -0.6409528 -0.4269969 debye
polarizability: 310.2380402|-14.5145874|246.0279722|7.189979|-21.5781502|147.6268697 unknown
InChI: InChI=1S/C18H16N2O4/c1-11-14(9-17(21)22)15-8-13(24-2)5-6-16(15)20(11)18(23)12-4-3-7-19-10-12/h3-8,10,21H,9H2,1-2H3
charge 0 multiplicity 1
40 atoms
O  2.390586 -3.849826 -0.169762
O  -2.2169 2.295271 -1.48923
O  4.430263 0.860618 1.30322
O  3.444848 2.935648 1.654905
N  -0.523673 0.942479 -0.597868
N  -3.717585 -0.683678 1.924159
C  1.755526 1.190591 -0.534915
C  1.453252 -0.229058 -0.41838
C  0.0341 -0.375237 -0.470962
C  0.557104 1.886519 -0.654622
C  3.144304 1.79084 -0.524725
C  2.295663 -1.362977 -0.30681
C  -0.563407 -1.654773 -0.480561
C  0.333329 3.368365 -0.743928
C  -1.888867 1.291196 -0.792477
C  1.688808 -2.637617 -0.282501
C  0.274446 -2.77974 -0.381744
C  -2.93301 0.482293 -0.08499
C  3.662907 1.966761 0.898145
C  -4.221236 0.372086 -0.667569
C  -2.738192 -0.0479 1.219698
C  -5.23895 -0.293715 0.043816
C  3.848457 -3.773347 -0.064368
C  -4.941472 -0.809967 1.327817
H  3.140115 2.786035 -0.998178
H  3.841698 1.142415 -1.081916
H  3.378343 -1.232661 -0.232127
H  -1.642927 -1.796994 -0.562377
H  1.270655 3.900254 -0.514285
H  -0.027809 3.670019 -1.74189
H  -0.429312 3.709031 -0.021156
H  -0.144055 -3.790148 -0.375101
H  -4.400949 0.814951 -1.652459
H  -1.77149 0.0477 1.725655
H  -6.242122 -0.409393 -0.377155
H  4.157702 -3.200588 0.831835
H  4.294442 -3.312792 -0.967829
H  4.186399 -4.816113 0.025503
H  4.709698 0.985312 2.251302
H  -5.702188 -1.340361 1.911729
