program: Orca
programVersion: 5.0.2
elementType: S S P O O C C C C C C C C H H H H H H H H H H H H H H H H H H H
charge: 0
multiplicity: 1
keywords: wb97x-d3
keywords: def2-TZVPP
keywords: def2/J RIJCOSX
keywords: DEFGRID2
keywords: scfconv7
keywords: smallprint printgap noloewdin
keywords: NOSOSCF
formula: C8H19O2PS2
InChI: InChI=1/C8H19O2PS2/c1-4-7-12-11(9,10-6-3)13-8-5-2/h4-8H2,1-3H3
32 atoms
S  1.67718 -0.723412 1.087928
S  -0.999356 1.097547 1.41102
P  -0.121006 -0.294323 0.13916
O  -0.931939 -1.655002 0.395021
O  -0.047409 0.155237 -1.270207
C  2.619547 0.76954 0.605815
C  -2.109097 1.933778 0.222923
C  3.244601 0.664255 -0.774972
C  -3.286768 1.091406 -0.235479
C  4.046215 1.912084 -1.119662
C  -4.224668 1.890863 -1.128863
C  -1.104999 -2.60275 -0.670514
C  0.170888 -3.327437 -1.037704
H  3.38346 0.877827 1.377604
H  1.962461 1.637592 0.689763
H  -1.511965 2.274766 -0.622173
H  -2.453285 2.81902 0.761846
H  3.888716 -0.216602 -0.811273
H  2.458715 0.510615 -1.513775
H  -2.920017 0.222019 -0.783618
H  -3.82398 0.709895 0.634906
H  4.493248 1.825608 -2.109467
H  4.854926 2.083014 -0.407346
H  3.414858 2.801546 -1.123207
H  -5.062593 1.27957 -1.463179
H  -3.708987 2.256255 -2.017989
H  -4.636784 2.754831 -0.605149
H  -1.523849 -2.101461 -1.545549
H  -1.851643 -3.302742 -0.29743
H  0.621784 -3.809236 -0.170964
H  -0.054731 -4.099919 -1.773913
H  0.90467 -2.654462 -1.479465
totalener: -1604.67273051 hartree
nucrepener: 1285.59734002 hartree
electener: -2890.27007053 hartree
oneelecener: -4764.86602745 hartree
twoeener: 1874.59595692 hartree
kineticenergy: 1600.35928830 hartree
xcener: -101.619886582579 hartree
chargesum: 0.0000000
charge: -0.164032 -0.154189 0.673580 -0.341178 -0.533255 -0.100068 -0.109701 -0.094996 -0.083472 -0.254660 -0.254096 0.042123 -0.261935 0.112451 0.096099 0.114797 0.108078 0.057776 0.083396 0.059015 0.066338 0.087563 0.072651 0.079665 0.086337 0.083317 0.074671 0.087382 0.094881 0.091610 0.085076 0.094779
qa: -0.1640 -0.1542 0.6736 -0.3412 -0.5333 -0.1001 -0.1097 -0.0950 -0.0835 -0.2547 -0.2541 0.0421 -0.2619 0.1125 0.0961 0.1148 0.1081 0.0578 0.0834 0.0590 0.0663 0.0876 0.0727 0.0797 0.0863 0.0833 0.0747 0.0874 0.0949 0.0916 0.0851 0.0948
va: 2.3002 2.3058 5.4123 2.0839 2.0486 3.8844 3.9082 3.8812 3.8874 3.9568 3.9563 3.8845 3.9277 1.0062 1.0332 1.0279 1.0065 1.0138 1.0319 1.0228 1.0166 1.0063 1.0024 1.0027 1.0060 1.0022 1.0037 1.0018 0.9881 1.0034 1.0134 1.0123
dispcorr: -0.013540525 hartree
energy: -1604.686271036768
dipole: -0.90585 0.74278 -0.16306 4.84210 -4.84763 -0.00553 -13.16296 12.98380 -0.17916
magnitude: 0.24232 au
magnitude: 0.61594 debye
