program: Orca
programVersion: 5.0.2
elementType: S S P O O C C C C C C C C H H H H H H H H H H H H H H H H H H H
charge: 0
multiplicity: 1
keywords: wb97x-d3
keywords: def2-TZVPP
keywords: def2/J RIJCOSX
keywords: DEFGRID2
keywords: scfconv7
keywords: smallprint printgap noloewdin
keywords: NOSOSCF
formula: C8H19O2PS2
InChI: InChI=1/C8H19O2PS2/c1-4-7-12-11(9,10-6-3)13-8-5-2/h4-8H2,1-3H3
32 atoms
S  1.325939 0.260689 1.399093
S  -1.01202 0.976216 -0.923682
P  0.273064 -0.508091 -0.223867
O  -0.595424 -1.577943 0.598319
O  1.05375 -1.005665 -1.374057
C  2.445622 1.382187 0.483414
C  -1.927443 1.491038 0.57321
C  3.691296 0.678418 -0.028748
C  -3.141609 0.638855 0.904024
C  4.627604 1.646918 -0.737976
C  -4.186724 0.599809 -0.198982
C  -0.97051 -2.824357 -0.010262
C  -2.034241 -2.666721 -1.074344
H  2.701697 2.168052 1.195735
H  1.885544 1.858786 -0.324048
H  -2.227864 2.519331 0.362401
H  -1.223532 1.529849 1.406483
H  4.207269 0.207329 0.810433
H  3.397849 -0.122587 -0.706781
H  -2.820419 -0.370863 1.159321
H  -3.585729 1.05343 1.813679
H  5.519395 1.132143 -1.094475
H  4.954941 2.450786 -0.076698
H  4.1465 2.103651 -1.603662
H  -4.554085 1.599919 -0.435434
H  -5.044731 -0.002955 0.098248
H  -3.782437 0.172825 -1.117115
H  -1.335029 -3.43652 0.8135
H  -0.084789 -3.310783 -0.4226
H  -2.923417 -2.170281 -0.685985
H  -1.668108 -2.101477 -1.930681
H  -2.331722 -3.653228 -1.432287
totalener: -1604.67161778 hartree
nucrepener: 1296.83197956 hartree
electener: -2901.50359735 hartree
oneelecener: -4787.18008483 hartree
twoeener: 1885.67648749 hartree
kineticenergy: 1600.35842085 hartree
xcener: -101.622315643192 hartree
chargesum: -0.0000000
charge: -0.161270 -0.152459 0.679356 -0.346936 -0.523548 -0.116492 -0.122757 -0.084028 -0.123736 -0.253232 -0.254735 0.025148 -0.260736 0.112010 0.099768 0.111191 0.115862 0.056338 0.085537 0.070911 0.075759 0.088097 0.069885 0.081267 0.083113 0.090921 0.077926 0.096049 0.104009 0.077768 0.105853 0.093158
qa: -0.1613 -0.1525 0.6794 -0.3469 -0.5235 -0.1165 -0.1228 -0.0840 -0.1237 -0.2532 -0.2547 0.0251 -0.2607 0.1120 0.0998 0.1112 0.1159 0.0563 0.0855 0.0709 0.0758 0.0881 0.0699 0.0813 0.0831 0.0909 0.0779 0.0960 0.1040 0.0778 0.1059 0.0932
va: 2.2960 2.2797 5.4208 2.0821 2.1044 3.8969 3.8628 3.8728 3.8895 3.9512 3.9206 3.8722 3.9147 1.0066 1.0305 1.0075 1.0384 1.0153 1.0332 1.0211 1.0121 1.0064 1.0027 1.0030 1.0061 1.0036 1.0136 0.9896 1.0075 0.9973 1.0118 1.0162
dispcorr: -0.014623658 hartree
energy: -1604.686241441451
dipole: -4.93495 4.23581 -0.69915 2.21458 -1.95323 0.26135 -1.34710 2.06074 0.71364
magnitude: 1.03267 au
magnitude: 2.62483 debye
