program: Orca
programVersion: 5.0.2
elementType: S S P O O C C C C C C C C H H H H H H H H H H H H H H H H H H H
charge: 0
multiplicity: 1
keywords: wb97x-d3
keywords: def2-TZVPP
keywords: def2/J RIJCOSX
keywords: DEFGRID2
keywords: scfconv7
keywords: smallprint printgap noloewdin
keywords: NOSOSCF
formula: C8H19O2PS2
InChI: InChI=1/C8H19O2PS2/c1-4-7-12-11(9,10-6-3)13-8-5-2/h4-8H2,1-3H3
32 atoms
S  0.838442 1.201008 0.763533
S  -2.007852 -0.403672 0.330723
P  -0.002912 -0.427795 -0.234039
O  0.515377 -1.691864 0.607918
O  0.254103 -0.447941 -1.69259
C  2.137889 1.730061 -0.415132
C  -2.687773 0.725654 -0.941702
C  3.52275 1.186948 -0.106469
C  -2.364516 2.198297 -0.749494
C  3.641167 -0.323258 -0.22672
C  -2.7946 2.758915 0.595294
C  0.672336 -2.978158 -0.010248
C  -0.639525 -3.710402 -0.181427
H  2.129661 2.818748 -0.350995
H  1.813679 1.459595 -1.420225
H  -3.764991 0.558002 -0.880852
H  -2.355404 0.368581 -1.915646
H  4.215206 1.667285 -0.804766
H  3.827454 1.506613 0.89261
H  -1.296038 2.363208 -0.896363
H  -2.868002 2.739069 -1.556463
H  3.056757 -0.827552 0.541978
H  4.677385 -0.639623 -0.109828
H  3.291664 -0.672472 -1.19941
H  -2.606027 3.830895 0.647125
H  -2.249169 2.288246 1.41285
H  -3.860696 2.602063 0.770808
H  1.335131 -3.527308 0.657384
H  1.182224 -2.867232 -0.969085
H  -1.176377 -3.791714 0.763173
H  -1.289107 -3.215948 -0.902367
H  -0.443043 -4.719384 -0.545825
totalener: -1604.67021820 hartree
nucrepener: 1311.96955698 hartree
electener: -2916.63977518 hartree
oneelecener: -4817.69240441 hartree
twoeener: 1901.05262923 hartree
kineticenergy: 1600.35170739 hartree
xcener: -101.620977193879 hartree
chargesum: -0.0000000
charge: -0.165750 -0.168124 0.692482 -0.345732 -0.531253 -0.120382 -0.129433 -0.087237 -0.117293 -0.264146 -0.236506 0.029228 -0.252674 0.114065 0.118205 0.111907 0.129078 0.066051 0.062835 0.068233 0.074003 0.080686 0.090533 0.084005 0.084689 0.080309 0.075633 0.093922 0.095534 0.089901 0.091352 0.085881
qa: -0.1657 -0.1681 0.6925 -0.3457 -0.5313 -0.1204 -0.1294 -0.0872 -0.1173 -0.2641 -0.2365 0.0292 -0.2527 0.1141 0.1182 0.1119 0.1291 0.0661 0.0628 0.0682 0.0740 0.0807 0.0905 0.0840 0.0847 0.0803 0.0756 0.0939 0.0955 0.0899 0.0914 0.0859
va: 2.2753 2.2900 5.4009 2.0848 2.0635 3.8833 3.8999 3.8980 3.8924 3.9291 3.9274 3.8836 3.9309 1.0036 1.0340 1.0023 1.0250 1.0096 1.0124 1.0199 1.0102 1.0138 1.0090 1.0082 1.0071 1.0167 1.0045 0.9865 1.0017 1.0036 1.0150 1.0125
dispcorr: -0.015004300 hartree
energy: -1604.685222498709
dipole: 3.70605 -3.60081 0.10524 2.21079 -2.17353 0.03725 -3.95467 3.87161 -0.08305
magnitude: 0.13915 au
magnitude: 0.35368 debye
