program: Orca
programVersion: 5.0.2
elementType: S S P O O C C C C C C C C H H H H H H H H H H H H H H H H H H H
charge: 0
multiplicity: 1
keywords: wb97x-d3
keywords: def2-TZVPP
keywords: def2/J RIJCOSX
keywords: DEFGRID2
keywords: scfconv7
keywords: smallprint printgap noloewdin
keywords: NOSOSCF
formula: C8H19O2PS2
InChI: InChI=1/C8H19O2PS2/c1-4-7-12-11(9,10-6-3)13-8-5-2/h4-8H2,1-3H3
32 atoms
S  1.831699 -0.845424 0.443814
S  -0.862552 0.899001 0.989955
P  0.115934 -0.167761 -0.522528
O  -0.690009 -1.533472 -0.742174
O  0.26815 0.606672 -1.767593
C  2.730697 0.737599 0.632562
C  -2.019892 1.863584 -0.053878
C  3.494916 1.15227 -0.61272
C  -3.148583 1.047712 -0.6633
C  4.254985 2.451746 -0.382749
C  -4.044544 0.365988 0.357785
C  -0.999237 -2.446649 0.312562
C  -2.18327 -3.284764 -0.104511
H  3.407297 0.568659 1.472148
H  2.021372 1.505462 0.947548
H  -1.43489 2.364569 -0.82336
H  -2.411663 2.628833 0.619282
H  4.188166 0.356335 -0.891888
H  2.798218 1.265859 -1.443384
H  -3.744557 1.731904 -1.274224
H  -2.73707 0.314259 -1.358936
H  4.974634 2.360551 0.432643
H  3.577592 3.27059 -0.135857
H  4.806666 2.74283 -1.276129
H  -4.509148 1.091541 1.027636
H  -3.486038 -0.338001 0.975314
H  -4.844913 -0.18658 -0.134153
H  -1.225115 -1.901641 1.233866
H  -0.127812 -3.077993 0.505058
H  -1.978969 -3.832449 -1.023584
H  -2.409715 -4.010547 0.67659
H  -3.068365 -2.668398 -0.259349
totalener: -1604.67191765 hartree
nucrepener: 1293.33369882 hartree
electener: -2898.00561647 hartree
oneelecener: -4780.07565935 hartree
twoeener: 1882.07004289 hartree
kineticenergy: 1600.35128917 hartree
xcener: -101.620178409557 hartree
chargesum: -0.0000000
charge: -0.184565 -0.199154 0.696340 -0.318655 -0.515305 -0.114648 -0.114004 -0.079488 -0.111084 -0.254549 -0.257324 -0.022611 -0.222922 0.113450 0.102051 0.132061 0.109206 0.057952 0.085712 0.073870 0.076794 0.071414 0.079242 0.089615 0.084149 0.068492 0.092899 0.101597 0.108083 0.092943 0.079515 0.078923
qa: -0.1846 -0.1992 0.6963 -0.3187 -0.5153 -0.1146 -0.1140 -0.0795 -0.1111 -0.2545 -0.2573 -0.0226 -0.2229 0.1135 0.1021 0.1321 0.1092 0.0580 0.0857 0.0739 0.0768 0.0714 0.0792 0.0896 0.0841 0.0685 0.0929 0.1016 0.1081 0.0929 0.0795 0.0789
va: 2.2908 2.2550 5.4215 2.0988 2.1178 3.9089 3.8934 3.8616 3.8657 3.9531 3.9274 3.8870 3.9562 1.0058 1.0319 1.0274 1.0038 1.0165 1.0337 1.0119 1.0271 1.0024 1.0029 1.0062 1.0082 1.0078 1.0032 0.9942 0.9897 1.0059 1.0074 1.0073
dispcorr: -0.014011183 hartree
energy: -1604.685928834456
dipole: -5.86503 5.49832 -0.36672 3.46291 -3.57175 -0.10884 0.90836 0.04710 0.95546
magnitude: 1.02919 au
magnitude: 2.61598 debye
