program: Orca
programVersion: 5.0.2
elementType: S S P O O C C C C C C C C H H H H H H H H H H H H H H H H H H H
charge: 0
multiplicity: 1
keywords: wb97x-d3
keywords: def2-TZVPP
keywords: def2/J RIJCOSX
keywords: DEFGRID2
keywords: scfconv7
keywords: smallprint printgap noloewdin
keywords: NOSOSCF
formula: C8H19O2PS2
InChI: InChI=1/C8H19O2PS2/c1-4-7-12-11(9,10-6-3)13-8-5-2/h4-8H2,1-3H3
32 atoms
S  1.604998 -0.088196 0.888083
S  -1.683551 -0.117158 0.456927
P  0.102964 -0.810571 -0.359292
O  0.042827 -2.356367 0.055801
O  0.30447 -0.498878 -1.791305
C  2.824062 0.479231 -0.357184
C  -1.596546 1.603067 -0.152412
C  2.543638 1.868316 -0.903721
C  -2.829263 2.367847 0.304383
C  2.585299 2.963748 0.148627
C  -2.794344 3.81047 -0.18154
C  -0.896283 -3.241657 -0.574548
C  -0.345131 -4.645646 -0.508117
H  2.875979 -0.256723 -1.156973
H  3.777101 0.45311 0.175114
H  -1.525235 1.585442 -1.239637
H  -0.689078 2.063891 0.245007
H  3.295397 2.072005 -1.672072
H  1.582504 1.860968 -1.419335
H  -3.727046 1.871724 -0.071548
H  -2.892711 2.344372 1.39441
H  2.3946 3.939868 -0.29703
H  3.56056 3.010974 0.636339
H  1.837124 2.803013 0.925915
H  -1.922851 4.340229 0.205753
H  -3.680992 4.353725 0.143945
H  -2.757388 3.86274 -1.270364
H  -1.063727 -2.942061 -1.611923
H  -1.852093 -3.174282 -0.049111
H  -0.170586 -4.955286 0.521782
H  -1.057906 -5.340814 -0.952543
H  0.592863 -4.727443 -1.056401
totalener: -1604.67146642 hartree
nucrepener: 1271.44604453 hartree
electener: -2876.11751095 hartree
oneelecener: -4736.46467031 hartree
twoeener: 1860.34715936 hartree
kineticenergy: 1600.34794780 hartree
xcener: -101.616186034623 hartree
chargesum: 0.0000000
charge: -0.160745 -0.179596 0.700874 -0.336175 -0.528881 -0.096754 -0.084740 -0.133069 -0.102125 -0.237581 -0.255452 0.005636 -0.229730 0.120577 0.110075 0.115521 0.079015 0.071131 0.078576 0.073037 0.071612 0.087761 0.077571 0.069887 0.077326 0.088910 0.078489 0.100490 0.090559 0.086272 0.075317 0.086213
qa: -0.1607 -0.1796 0.7009 -0.3362 -0.5289 -0.0968 -0.0847 -0.1331 -0.1021 -0.2376 -0.2555 0.0056 -0.2297 0.1206 0.1101 0.1155 0.0790 0.0711 0.0786 0.0730 0.0716 0.0878 0.0776 0.0699 0.0773 0.0889 0.0785 0.1005 0.0906 0.0863 0.0753 0.0862
va: 2.2754 2.3011 5.4278 2.1402 2.0780 3.8633 3.9402 3.9105 3.9069 3.9098 3.9541 3.9085 3.9671 1.0307 1.0078 1.0163 1.0089 1.0128 1.0199 1.0119 1.0097 1.0061 1.0047 1.0170 1.0028 1.0065 1.0036 0.9944 0.9896 1.0047 1.0078 1.0082
dispcorr: -0.012931478 hartree
energy: -1604.684397901276
dipole: -1.32827 1.14726 -0.18100 13.14960 -12.90311 0.24649 -3.85800 3.95009 0.09209
magnitude: 0.31938 au
magnitude: 0.81179 debye
