program: Orca
programVersion: 5.0.2
elementType: S S P O O C C C C C C C C H H H H H H H H H H H H H H H H H H H
charge: 0
multiplicity: 1
keywords: wb97x-d3
keywords: def2-TZVPP
keywords: def2/J RIJCOSX
keywords: DEFGRID2
keywords: scfconv7
keywords: smallprint printgap noloewdin
keywords: NOSOSCF
formula: C8H19O2PS2
InChI: InChI=1/C8H19O2PS2/c1-4-7-12-11(9,10-6-3)13-8-5-2/h4-8H2,1-3H3
32 atoms
S  1.939482 -0.758581 0.897207
S  -0.898433 0.901502 0.898292
P  0.111444 -0.614725 -0.089881
O  -0.657463 -1.925095 0.427863
O  0.215584 -0.453016 -1.557099
C  2.962605 0.29554 -0.193852
C  -2.373973 1.003499 -0.18357
C  2.728047 1.784733 -0.011853
C  -3.177149 2.244041 0.173768
C  3.654509 2.604291 -0.900361
C  -4.432632 2.347363 -0.681612
C  -0.398383 -3.187541 -0.204572
C  -1.37019 -3.442631 -1.333715
H  2.789321 -0.014437 -1.223903
H  3.989931 0.028941 0.062178
H  -2.971916 0.102209 -0.045384
H  -2.040362 1.041277 -1.220426
H  1.688779 2.021864 -0.246613
H  2.875273 2.050672 1.037039
H  -3.451472 2.216718 1.230947
H  -2.555936 3.131464 0.034629
H  4.704423 2.413021 -0.672106
H  3.479068 3.6714 -0.76692
H  3.49727 2.375169 -1.955295
H  -4.187281 2.393614 -1.743471
H  -5.001061 3.243804 -0.435825
H  -5.088765 1.489304 -0.530191
H  -0.505045 -3.934292 0.582381
H  0.635018 -3.236893 -0.560101
H  -1.205058 -4.439841 -1.743039
H  -2.400857 -3.39286 -0.98289
H  -1.238484 -2.719635 -2.136725
totalener: -1604.67317291 hartree
nucrepener: 1265.98696023 hartree
electener: -2870.66013313 hartree
oneelecener: -4725.61425466 hartree
twoeener: 1854.95412153 hartree
kineticenergy: 1600.35401887 hartree
xcener: -101.617024641089 hartree
chargesum: -0.0000000
charge: -0.172586 -0.144781 0.682637 -0.338673 -0.532729 -0.102599 -0.107902 -0.087799 -0.100229 -0.256280 -0.255715 0.036980 -0.248611 0.117950 0.107117 0.098411 0.113244 0.061275 0.064324 0.071092 0.071886 0.073236 0.087365 0.083457 0.079381 0.088542 0.076113 0.094914 0.079442 0.081395 0.079799 0.099343
qa: -0.1726 -0.1448 0.6826 -0.3387 -0.5327 -0.1026 -0.1079 -0.0878 -0.1002 -0.2563 -0.2557 0.0370 -0.2486 0.1180 0.1071 0.0984 0.1132 0.0613 0.0643 0.0711 0.0719 0.0732 0.0874 0.0835 0.0794 0.0885 0.0761 0.0949 0.0794 0.0814 0.0798 0.0993
va: 2.3001 2.2979 5.4198 2.0900 2.0655 3.8858 3.9322 3.8805 3.8977 3.9618 3.9535 3.9035 3.9301 1.0286 1.0045 1.0076 1.0181 1.0352 1.0136 1.0086 1.0123 1.0035 1.0053 1.0026 1.0033 1.0063 1.0036 0.9913 1.0085 1.0118 1.0044 1.0190
dispcorr: -0.012524271 hartree
energy: -1604.685697176094
dipole: -6.25915 6.01683 -0.24232 8.44108 -8.47759 -0.03651 -9.57501 9.56386 -0.01115
magnitude: 0.24531 au
magnitude: 0.62352 debye
