program: Orca
programVersion: 5.0.2
elementType: S S S S P P O O O O C C C C C C C C C H H H H H H H H H H H H H H H H H H H H H H
charge: 0
multiplicity: 1
keywords: wb97x-d3
keywords: def2-TZVPP
keywords: def2/J RIJCOSX
keywords: DEFGRID2
keywords: scfconv7
keywords: smallprint printgap noloewdin
keywords: NOSOSCF
formula: C9H22O4P2S4
InChI: InChI=1/C9H22O4P2S4/c1-5-10-14(16,11-6-2)18-9-19-15(17,12-7-3)13-8-4/h5-9H2,1-4H3
41 atoms
S  -2.075162 1.788659 -0.204454
S  0.759061 1.493937 -1.263257
S  -1.254916 -0.714429 1.967035
S  2.645862 0.909078 1.535268
P  -2.208001 -0.21489 0.370892
P  2.141499 0.316524 -0.226698
O  -3.797406 -0.400522 0.38865
O  -1.798103 -0.960578 -0.979657
O  1.509734 -1.146187 -0.337278
O  3.304534 0.232569 -1.325736
C  -0.316417 2.11605 0.068174
C  -4.576463 -0.385906 1.60407
C  -1.662233 -2.399883 -1.023558
C  1.902482 -2.207477 0.560741
C  4.472972 1.079142 -1.296509
C  -4.67863 0.987145 2.219978
C  -1.002657 -2.769545 -2.326098
C  3.339247 -2.633122 0.380707
C  4.182298 2.508765 -1.679633
H  -0.222089 3.200901 0.094919
H  0.003366 1.732379 1.039024
H  -5.556729 -0.750591 1.303665
H  -4.152349 -1.101714 2.310308
H  -1.066477 -2.737365 -0.173325
H  -2.652631 -2.851688 -0.942631
H  1.708048 -1.892451 1.586733
H  1.223157 -3.024886 0.325909
H  4.929314 1.025654 -0.306626
H  5.158033 0.620409 -2.006559
H  -5.074511 1.717834 1.514958
H  -5.361447 0.937505 3.068216
H  -3.717603 1.342782 2.591466
H  -0.892061 -3.852815 -2.370847
H  -1.600464 -2.459674 -3.18315
H  -0.010509 -2.327583 -2.414558
H  4.041359 -1.850623 0.670234
H  3.52945 -3.493639 1.022691
H  3.547382 -2.930396 -0.646775
H  3.700144 2.575977 -2.654562
H  3.556102 3.013268 -0.944156
H  5.126737 3.050329 -1.735454
elementType: S P O C H
totalener: -2932.91086659 hartree
nucrepener: 2771.08131850 hartree
electener: -5703.99218509 hartree
oneelecener: -9566.20996985 hartree
twoeener: 3862.21778476 hartree
cpcmener: -0.02531407 hartree
kineticenergy: 2925.76230013 hartree
xcener: -173.630523537297 hartree
chargesum: -0.0000000
charge: -0.133926 -0.138346 -0.441018 -0.442245 0.661369 0.642981 -0.371865 -0.340048 -0.340180 -0.368847 -0.082987 0.043423 -0.006547 0.038592 0.046733 -0.251445 -0.244386 -0.249508 -0.249954 0.173398 0.119148 0.110382 0.095575 0.100301 0.133332 0.095544 0.110835 0.093426 0.112021 0.092343 0.103426 0.076216 0.092631 0.095846 0.078145 0.080385 0.100286 0.092954 0.091388 0.076969 0.103651
qa: -0.1339 -0.1383 -0.4410 -0.4422 0.6614 0.6430 -0.3719 -0.3400 -0.3402 -0.3688 -0.0830 0.0434 -0.0065 0.0386 0.0467 -0.2514 -0.2444 -0.2495 -0.2500 0.1734 0.1191 0.1104 0.0956 0.1003 0.1333 0.0955 0.1108 0.0934 0.1120 0.0923 0.1034 0.0762 0.0926 0.0958 0.0781 0.0804 0.1003 0.0930 0.0914 0.0770 0.1037
va: 2.3037 2.3076 2.0052 1.9951 5.4061 5.4174 2.0982 2.0898 2.0909 2.0825 3.9089 3.8483 3.8298 3.8186 3.8404 3.8959 3.9396 3.9448 3.9117 0.9901 1.0651 0.9919 1.0125 1.0002 0.9977 1.0113 0.9830 1.0111 0.9907 1.0035 1.0111 1.0189 1.0062 1.0034 1.0175 1.0172 1.0069 1.0062 1.0040 1.0153 1.0107
dispcorr: -0.024668046 hartree
energy: -2932.935534634682
dipole: 5.19061 -5.35871 -0.16810 -10.81357 10.03462 -0.77896 -2.63412 2.12658 -0.50754
magnitude: 0.94479 au
magnitude: 2.40146 debye
