program: Orca
programVersion: 5.0.2
elementType: S S S S P P O O O O C C C C C C C C C H H H H H H H H H H H H H H H H H H H H H H
charge: 0
multiplicity: 1
keywords: wb97x-d3
keywords: def2-TZVPP
keywords: def2/J RIJCOSX
keywords: DEFGRID2
keywords: scfconv7
keywords: smallprint printgap noloewdin
keywords: NOSOSCF
formula: C9H22O4P2S4
InChI: InChI=1/C9H22O4P2S4/c1-5-10-14(16,11-6-2)18-9-19-15(17,12-7-3)13-8-4/h5-9H2,1-4H3
41 atoms
S  -0.846319 1.360106 0.716713
S  1.174371 -0.942693 0.81482
S  -2.734197 -1.446025 1.053611
S  3.443347 1.466755 1.60446
P  -2.251773 0.033061 -0.083054
P  2.757112 0.311433 0.230673
O  -3.396718 1.068593 -0.499613
O  -1.651993 -0.337657 -1.514589
O  3.731064 -0.781891 -0.407933
O  2.2676 1.146227 -1.034406
C  0.148864 0.235579 1.727541
C  -4.312179 1.604746 0.483962
C  -1.98653 -1.569804 -2.194353
C  4.874208 -1.334207 0.279918
C  1.735464 0.540807 -2.233742
C  -5.654118 0.92483 0.387224
C  -3.407322 -1.586019 -2.698609
C  4.486134 -2.384789 1.289293
C  0.899824 1.567914 -2.95067
H  0.773318 0.860929 2.367823
H  -0.503329 -0.354995 2.370752
H  -3.895956 1.506891 1.489993
H  -4.39062 2.669077 0.264077
H  -1.27728 -1.624944 -3.018177
H  -1.793306 -2.410455 -1.525662
H  5.491006 -1.758972 -0.509907
H  5.437307 -0.524872 0.747935
H  2.569953 0.210836 -2.853591
H  1.136234 -0.335169 -1.977174
H  -6.342648 1.397699 1.088817
H  -6.078229 1.018935 -0.613411
H  -5.586936 -0.132991 0.642791
H  -4.133176 -1.596876 -1.884584
H  -3.61518 -0.732231 -3.343675
H  -3.56005 -2.493321 -3.284131
H  3.925753 -1.964687 2.124763
H  3.894691 -3.179837 0.835173
H  5.393977 -2.833585 1.693356
H  0.492686 1.122605 -3.858463
H  0.065083 1.906435 -2.337667
H  1.492054 2.435419 -3.241886
elementType: S P O C H
totalener: -2932.91501535 hartree
nucrepener: 2721.92368951 hartree
electener: -5654.83870486 hartree
oneelecener: -9466.86724375 hartree
twoeener: 3812.02853889 hartree
cpcmener: -0.02507179 hartree
kineticenergy: 2925.75001480 hartree
xcener: -173.627726347115 hartree
chargesum: -0.0000000
charge: -0.141764 -0.147239 -0.442214 -0.437923 0.640931 0.630777 -0.361521 -0.341690 -0.346878 -0.335275 -0.110619 0.047470 0.042952 0.038060 0.009125 -0.245995 -0.237751 -0.243106 -0.241939 0.161445 0.165153 0.087127 0.112604 0.107102 0.097434 0.109401 0.094521 0.119546 0.093776 0.099586 0.091539 0.076911 0.076848 0.092573 0.100363 0.075086 0.092385 0.103311 0.095198 0.073348 0.099345
qa: -0.1418 -0.1472 -0.4422 -0.4379 0.6409 0.6308 -0.3615 -0.3417 -0.3469 -0.3353 -0.1106 0.0475 0.0430 0.0381 0.0091 -0.2460 -0.2378 -0.2431 -0.2419 0.1614 0.1652 0.0871 0.1126 0.1071 0.0974 0.1094 0.0945 0.1195 0.0938 0.0996 0.0915 0.0769 0.0768 0.0926 0.1004 0.0751 0.0924 0.1033 0.0952 0.0733 0.0993
va: 2.3117 2.3001 1.9981 2.0239 5.4109 5.4418 2.0787 2.0985 2.0905 2.1091 3.8945 3.8459 3.8250 3.8544 3.8449 3.9370 3.9217 3.8878 3.9315 1.0268 1.0218 1.0108 0.9931 0.9887 1.0123 0.9903 1.0109 1.0000 1.0017 1.0087 1.0026 1.0159 1.0155 1.0062 1.0083 1.0178 1.0030 1.0111 1.0057 1.0211 1.0062
dispcorr: -0.023161466 hartree
energy: -2932.938176819084
dipole: -11.05075 10.28949 -0.76127 -7.25147 6.13676 -1.11471 -14.09685 12.64298 -1.45386
magnitude: 1.98389 au
magnitude: 5.04265 debye
