program: Orca
programVersion: 5.0.2
elementType: S S S S P P O O O O C C C C C C C C C H H H H H H H H H H H H H H H H H H H H H H
charge: 0
multiplicity: 1
keywords: wb97x-d3
keywords: def2-TZVPP
keywords: def2/J RIJCOSX
keywords: DEFGRID2
keywords: scfconv7
keywords: smallprint printgap noloewdin
keywords: NOSOSCF
formula: C9H22O4P2S4
InChI: InChI=1/C9H22O4P2S4/c1-5-10-14(16,11-6-2)18-9-19-15(17,12-7-3)13-8-4/h5-9H2,1-4H3
41 atoms
S  -1.851094 0.113792 2.096807
S  0.60921 1.637747 1.015772
S  -3.972542 -1.560939 0.271634
S  2.54627 -1.123372 0.367177
P  -2.235446 -0.741739 0.228361
P  1.832327 0.542369 -0.290114
O  -1.999021 0.395433 -0.865662
O  -0.970451 -1.63075 -0.151741
O  0.941168 0.478981 -1.612124
O  2.899093 1.665846 -0.692673
C  -0.052522 0.361812 2.121552
C  -2.804671 1.586275 -0.891562
C  -0.89175 -3.045041 0.118529
C  1.18391 -0.487626 -2.65748
C  4.186856 1.788293 -0.053915
C  -2.268889 2.490536 -1.970607
C  -0.745024 -3.364606 1.58514
C  2.445234 -0.201591 -3.433414
C  4.108488 2.305619 1.361181
H  0.155829 0.686621 3.140558
H  0.479643 -0.57695 1.969969
H  -3.8442 1.313669 -1.086357
H  -2.759492 2.079179 0.082588
H  -1.769992 -3.536754 -0.303081
H  -0.018055 -3.37669 -0.438884
H  1.210121 -1.488853 -2.223492
H  0.306284 -0.421479 -3.297595
H  4.694175 0.82295 -0.089023
H  4.738674 2.480802 -0.686771
H  -2.872929 3.396579 -2.00578
H  -1.237324 2.781163 -1.771929
H  -2.317696 2.018054 -2.951584
H  0.124976 -2.873638 2.020906
H  -1.6301 -3.090448 2.159275
H  -0.605926 -4.440913 1.690969
H  3.341316 -0.337567 -2.827246
H  2.507217 -0.899409 -4.268902
H  2.447281 0.808762 -3.841303
H  3.576103 3.254328 1.41701
H  3.629715 1.596195 2.035266
H  5.123719 2.470127 1.723509
elementType: S P O C H
totalener: -2932.91168815 hartree
nucrepener: 2815.92082035 hartree
electener: -5748.83250850 hartree
oneelecener: -9655.12561265 hartree
twoeener: 3906.29310415 hartree
cpcmener: -0.02581994 hartree
kineticenergy: 2925.77453382 hartree
xcener: -173.635191466039 hartree
chargesum: -0.0000000
charge: -0.141002 -0.137529 -0.440552 -0.442924 0.599410 0.672509 -0.320523 -0.322650 -0.351360 -0.372678 -0.076976 0.002655 0.019680 0.038154 0.040737 -0.242710 -0.248474 -0.244828 -0.246933 0.172629 0.112290 0.112110 0.104026 0.107629 0.104318 0.092459 0.108524 0.095321 0.112128 0.097282 0.077594 0.092566 0.092001 0.084336 0.109226 0.078191 0.100234 0.092520 0.090415 0.076317 0.103879
qa: -0.1410 -0.1375 -0.4406 -0.4429 0.5994 0.6725 -0.3205 -0.3227 -0.3514 -0.3727 -0.0770 0.0027 0.0197 0.0382 0.0407 -0.2427 -0.2485 -0.2448 -0.2469 0.1726 0.1123 0.1121 0.1040 0.1076 0.1043 0.0925 0.1085 0.0953 0.1121 0.0973 0.0776 0.0926 0.0920 0.0843 0.1092 0.0782 0.1002 0.0925 0.0904 0.0763 0.1039
va: 2.2932 2.3157 2.0360 1.9956 5.4784 5.3713 2.0971 2.1092 2.0789 2.0910 3.9266 3.8419 3.8327 3.8439 3.8438 3.9448 3.8886 3.9325 3.9100 0.9937 1.0601 1.0051 0.9991 1.0144 0.9926 1.0062 0.9913 1.0107 0.9908 1.0082 1.0143 1.0031 1.0013 1.0161 1.0119 1.0158 1.0078 1.0059 1.0053 1.0142 1.0106
dispcorr: -0.026425026 hartree
energy: -2932.938113171554
dipole: 15.11247 -13.06859 2.04388 2.79881 -2.07906 0.71974 -9.53755 9.30402 -0.23353
magnitude: 2.17945 au
magnitude: 5.53972 debye
