program: Orca
programVersion: 5.0.2
elementType: S S S S P P O O O O C C C C C C C C C H H H H H H H H H H H H H H H H H H H H H H
charge: 0
multiplicity: 1
keywords: wb97x-d3
keywords: def2-TZVPP
keywords: def2/J RIJCOSX
keywords: DEFGRID2
keywords: scfconv7
keywords: smallprint printgap noloewdin
keywords: NOSOSCF
formula: C9H22O4P2S4
InChI: InChI=1/C9H22O4P2S4/c1-5-10-14(16,11-6-2)18-9-19-15(17,12-7-3)13-8-4/h5-9H2,1-4H3
41 atoms
S  -0.597942 -1.725225 0.056164
S  0.844551 0.818519 1.009614
S  -3.206607 -0.219653 1.67159
S  3.613133 -1.130424 0.709535
P  -2.403799 -0.668481 -0.020666
P  2.637503 0.372024 0.007832
O  -2.030398 0.553962 -0.973953
O  -3.249902 -1.599868 -1.005986
O  2.342045 0.220216 -1.546522
O  3.338749 1.807825 0.081255
C  0.232891 -0.83962 1.399964
C  -2.675408 1.843019 -0.893334
C  -4.210045 -2.573495 -0.540733
C  1.284169 0.871347 -2.286145
C  4.068698 2.232582 1.255534
C  -4.071464 1.819705 -1.462631
C  -3.558283 -3.803345 0.038363
C  1.367053 2.377481 -2.302825
C  5.554169 2.10384 1.032204
H  -0.450721 -0.726499 2.241838
H  1.060726 -1.471592 1.725045
H  -2.675833 2.180676 0.144283
H  -2.026587 2.507059 -1.462487
H  -4.87645 -2.102051 0.183503
H  -4.795287 -2.822218 -1.423944
H  1.387002 0.474116 -3.294136
H  0.32586 0.535667 -1.891817
H  3.782174 3.270156 1.4210
H  3.754042 1.659061 2.130466
H  -4.07919 1.462754 -2.49218
H  -4.74247 1.196735 -0.870291
H  -4.472737 2.833475 -1.456697
H  -2.863578 -4.260512 -0.666135
H  -3.026912 -3.589735 0.965783
H  -4.334244 -4.535249 0.264177
H  2.339162 2.727662 -2.648691
H  0.614267 2.747607 -2.999649
H  1.154969 2.824759 -1.331975
H  5.87931 2.675608 0.162781
H  6.080857 2.493095 1.904025
H  5.849887 1.063478 0.897993
elementType: S P O C H
totalener: -2932.91219316 hartree
nucrepener: 2711.13132300 hartree
electener: -5644.04351616 hartree
oneelecener: -9445.02066857 hartree
twoeener: 3800.97715241 hartree
cpcmener: -0.02480081 hartree
kineticenergy: 2925.75953584 hartree
xcener: -173.631591445082 hartree
chargesum: -0.0000000
charge: -0.133945 -0.150766 -0.443364 -0.442687 0.637492 0.625622 -0.334626 -0.363058 -0.343239 -0.345726 -0.119234 0.043965 0.045978 0.049276 0.045569 -0.237813 -0.250358 -0.253798 -0.237539 0.163366 0.168269 0.094580 0.104238 0.095870 0.112099 0.114332 0.070870 0.111368 0.086191 0.091153 0.079439 0.098632 0.092883 0.077533 0.103904 0.100210 0.104575 0.078358 0.090586 0.095427 0.074366
qa: -0.1339 -0.1508 -0.4434 -0.4427 0.6375 0.6256 -0.3346 -0.3631 -0.3432 -0.3457 -0.1192 0.0440 0.0460 0.0493 0.0456 -0.2378 -0.2504 -0.2538 -0.2375 0.1634 0.1683 0.0946 0.1042 0.0959 0.1121 0.1143 0.0709 0.1114 0.0862 0.0912 0.0794 0.0986 0.0929 0.0775 0.1039 0.1002 0.1046 0.0784 0.0906 0.0954 0.0744
va: 2.3066 2.2959 1.9992 2.0208 5.4118 5.4421 2.0996 2.0899 2.1096 2.0708 3.8985 3.8374 3.8389 3.8440 3.8339 3.9241 3.9020 3.9002 3.9413 1.0261 1.0241 1.0132 0.9880 1.0115 0.9911 0.9950 1.0291 0.9937 1.0107 1.0060 1.0170 1.0077 1.0032 1.0166 1.0106 1.0088 1.0054 1.0127 1.0040 1.0076 1.0186
dispcorr: -0.022946447 hartree
energy: -2932.935139610405
dipole: -6.16970 4.70496 -1.46473 11.10129 -9.57209 1.52919 -8.17309 7.53078 -0.64231
magnitude: 2.21279 au
magnitude: 5.62447 debye
