program: Orca
programVersion: 5.0.2
elementType: S S S S P P O O O O C C C C C C C C C H H H H H H H H H H H H H H H H H H H H H H
charge: 0
multiplicity: 1
keywords: wb97x-d3
keywords: def2-TZVPP
keywords: def2/J RIJCOSX
keywords: DEFGRID2
keywords: scfconv7
keywords: smallprint printgap noloewdin
keywords: NOSOSCF
formula: C9H22O4P2S4
InChI: InChI=1/C9H22O4P2S4/c1-5-10-14(16,11-6-2)18-9-19-15(17,12-7-3)13-8-4/h5-9H2,1-4H3
41 atoms
S  -0.698438 -1.303319 0.900464
S  0.39748 1.556947 0.697161
S  -3.628076 0.321209 1.469128
S  3.30234 -0.102054 1.354447
P  -2.561413 -0.639127 0.191451
P  2.245269 0.832374 0.041784
O  -2.283945 0.225986 -1.116329
O  -3.135656 -2.003856 -0.408099
O  1.830261 0.009611 -1.260759
O  2.886093 2.147539 -0.603104
C  -0.138883 0.189307 1.756737
C  -1.580096 -0.293815 -2.268246
C  -4.001129 -2.902718 0.318711
C  2.789485 -0.770424 -2.010263
C  3.778795 3.026586 0.11496
C  -1.058305 0.869185 -3.068901
C  -3.245627 -3.77674 1.287541
C  2.077342 -1.954888 -2.607701
C  3.074234 3.859765 1.156403
H  -0.940732 0.580275 2.384469
H  0.679478 -0.114766 2.410598
H  -0.762937 -0.941224 -1.945027
H  -2.274612 -0.893859 -2.857191
H  -4.773753 -2.324198 0.828025
H  -4.482122 -3.502571 -0.451572
H  3.216544 -0.129654 -2.782901
H  3.598117 -1.097719 -1.353434
H  4.580206 2.435234 0.56093
H  4.215301 3.659154 -0.655661
H  -0.53122 0.488564 -3.943778
H  -1.868196 1.507853 -3.421135
H  -0.36139 1.476282 -2.49283
H  -3.937015 -4.506242 1.710253
H  -2.44366 -4.325356 0.793599
H  -2.822838 -3.206045 2.114028
H  2.788498 -2.542036 -3.18902
H  1.662185 -2.599944 -1.833172
H  1.273245 -1.647332 -3.277104
H  2.245206 4.423945 0.729337
H  2.697774 3.257409 1.982906
H  3.786487 4.575003 1.56864
elementType: S P O C H
totalener: -2932.91522443 hartree
nucrepener: 2736.32101358 hartree
electener: -5669.23623801 hartree
oneelecener: -9495.73758835 hartree
twoeener: 3826.50135035 hartree
cpcmener: -0.02548277 hartree
kineticenergy: 2925.76316664 hartree
xcener: -173.629824872571 hartree
chargesum: -0.0000000
charge: -0.148957 -0.133365 -0.436953 -0.446883 0.629321 0.640109 -0.336241 -0.343674 -0.328681 -0.363622 -0.112096 0.028678 0.036579 0.030093 0.040282 -0.247665 -0.244809 -0.254957 -0.250096 0.165116 0.165040 0.078803 0.119299 0.092970 0.108477 0.113621 0.095749 0.096038 0.111198 0.096292 0.101583 0.072076 0.102913 0.092950 0.076484 0.107279 0.085231 0.087832 0.092698 0.077761 0.103527
qa: -0.1490 -0.1334 -0.4370 -0.4469 0.6293 0.6401 -0.3362 -0.3437 -0.3287 -0.3636 -0.1121 0.0287 0.0366 0.0301 0.0403 -0.2477 -0.2448 -0.2550 -0.2501 0.1651 0.1650 0.0788 0.1193 0.0930 0.1085 0.1136 0.0957 0.0960 0.1112 0.0963 0.1016 0.0721 0.1029 0.0930 0.0765 0.1073 0.0852 0.0878 0.0927 0.0778 0.1035
va: 2.2940 2.3063 2.0290 2.0086 5.4464 5.4104 2.1100 2.0945 2.1059 2.0902 3.8968 3.8370 3.8594 3.8284 3.8507 3.9343 3.8868 3.9412 3.8945 1.0232 1.0230 1.0092 1.0012 1.0110 0.9900 0.9957 1.0107 1.0110 0.9906 1.0044 1.0069 1.0206 1.0111 1.0026 1.0176 1.0090 1.0069 1.0005 1.0031 1.0164 1.0112
dispcorr: -0.023585316 hartree
energy: -2932.938809743775
dipole: 6.23404 -5.09461 1.13944 -5.30550 4.41434 -0.89117 -13.55714 11.94874 -1.60840
magnitude: 2.16320 au
magnitude: 5.49843 debye
