program: Orca
programVersion: 5.0.2
elementType: S S S S P P O O O O C C C C C C C C C H H H H H H H H H H H H H H H H H H H H H H
charge: 0
multiplicity: 1
keywords: wb97x-d3
keywords: def2-TZVPP
keywords: def2/J RIJCOSX
keywords: DEFGRID2
keywords: scfconv7
keywords: smallprint printgap noloewdin
keywords: NOSOSCF
formula: C9H22O4P2S4
InChI: InChI=1/C9H22O4P2S4/c1-5-10-14(16,11-6-2)18-9-19-15(17,12-7-3)13-8-4/h5-9H2,1-4H3
41 atoms
S  -0.472374 -1.594428 0.882281
S  0.344513 1.371948 1.183469
S  -3.422683 0.116922 1.051056
S  3.271366 -0.354314 1.104513
P  -2.195087 -0.870398 -0.057541
P  2.060907 0.790947 0.137589
O  -1.583471 -0.106274 -1.314859
O  -2.742925 -2.213026 -0.734944
O  1.457449 0.230464 -1.227101
O  2.617018 2.211846 -0.343871
C  -0.085527 -0.200631 1.975337
C  -2.289697 0.914377 -2.052493
C  -3.787946 -3.021905 -0.155061
C  2.050404 -0.853483 -1.968812
C  3.649316 2.934668 0.360464
C  -1.289447 1.915063 -2.570339
C  -3.308921 -3.845532 1.013789
C  3.279501 -0.414614 -2.724084
C  3.1388 3.613828 1.606113
H  -0.937772 0.013511 2.620265
H  0.739933 -0.537139 2.602486
H  -2.829917 0.432539 -2.86843
H  -3.019438 1.400489 -1.40286
H  -4.622541 -2.380274 0.132899
H  -4.122976 -3.661342 -0.96966
H  2.274055 -1.67785 -1.289923
H  1.266102 -1.182227 -2.648059
H  4.471174 2.254792 0.591663
H  4.011346 3.6651 -0.360347
H  -1.81834 2.674514 -3.146317
H  -0.76763 2.415259 -1.754752
H  -0.553858 1.453141 -3.228613
H  -3.045745 -3.228387 1.872844
H  -4.11359 -4.513632 1.322277
H  -2.448726 -4.460326 0.748377
H  3.063514 0.423382 -3.386585
H  4.089092 -0.130095 -2.051052
H  3.635886 -1.243281 -3.336537
H  2.844353 2.898356 2.373967
H  3.937647 4.230039 2.019599
H  2.291659 4.265193 1.391358
elementType: S P O C H
totalener: -2932.91183288 hartree
nucrepener: 2773.65184232 hartree
electener: -5706.56367520 hartree
oneelecener: -9571.21524710 hartree
twoeener: 3864.65157190 hartree
cpcmener: -0.02389664 hartree
kineticenergy: 2925.77536544 hartree
xcener: -173.635225605758 hartree
chargesum: -0.0000000
charge: -0.138824 -0.142566 -0.454226 -0.445791 0.660680 0.647027 -0.332963 -0.368426 -0.339392 -0.368477 -0.108836 0.033262 0.038186 0.044046 0.041872 -0.258297 -0.249371 -0.240575 -0.250546 0.163853 0.164648 0.112337 0.094483 0.095061 0.110313 0.094857 0.103330 0.093801 0.110855 0.104865 0.079135 0.090722 0.077513 0.103781 0.091630 0.091700 0.077936 0.098737 0.077641 0.103695 0.092327
qa: -0.1388 -0.1426 -0.4542 -0.4458 0.6607 0.6470 -0.3330 -0.3684 -0.3394 -0.3685 -0.1088 0.0333 0.0382 0.0440 0.0419 -0.2583 -0.2494 -0.2406 -0.2505 0.1639 0.1646 0.1123 0.0945 0.0951 0.1103 0.0949 0.1033 0.0938 0.1109 0.1049 0.0791 0.0907 0.0775 0.1038 0.0916 0.0917 0.0779 0.0987 0.0776 0.1037 0.0923
va: 2.2997 2.2986 1.9938 1.9969 5.4051 5.3961 2.1037 2.0963 2.0855 2.0807 3.8998 3.8301 3.8595 3.8204 3.8521 3.9441 3.8907 3.9371 3.8993 1.0175 1.0199 0.9941 1.0113 1.0114 0.9912 1.0149 0.9949 1.0120 0.9910 1.0106 1.0112 1.0030 1.0170 1.0108 1.0036 1.0052 1.0179 1.0075 1.0173 1.0106 1.0033
dispcorr: -0.023641737 hartree
energy: -2932.935474620342
dipole: 4.02709 -4.01527 0.01182 2.98531 -2.98075 0.00456 -11.07266 10.05798 -1.01468
magnitude: 1.01476 au
magnitude: 2.57932 debye
