program: Orca
programVersion: 5.0.2
elementType: S S S S P P O O O O C C C C C C C C C H H H H H H H H H H H H H H H H H H H H H H
charge: 0
multiplicity: 1
keywords: wb97x-d3
keywords: def2-TZVPP
keywords: def2/J RIJCOSX
keywords: DEFGRID2
keywords: scfconv7
keywords: smallprint printgap noloewdin
keywords: NOSOSCF
formula: C9H22O4P2S4
InChI: InChI=1/C9H22O4P2S4/c1-5-10-14(16,11-6-2)18-9-19-15(17,12-7-3)13-8-4/h5-9H2,1-4H3
41 atoms
S  -1.101643 1.170347 0.970488
S  0.991066 -1.073226 0.72719
S  -3.18439 -1.541681 0.930874
S  3.146686 1.358801 1.747731
P  -2.485574 -0.029404 -0.03793
P  2.468029 0.344061 0.263367
O  -3.548325 1.06741 -0.518218
O  -1.71043 -0.340192 -1.394895
O  3.480562 -0.599548 -0.537319
O  1.87756 1.297183 -0.86623
C  -0.097531 -0.095261 1.791153
C  -4.769263 1.346587 0.200355
C  -2.187172 -1.338503 -2.330825
C  4.677669 -1.159302 0.045785
C  1.404942 0.830963 -2.152259
C  -4.53578 2.121594 1.472923
C  -1.292551 -2.549507 -2.296601
C  4.388469 -2.356133 0.915606
C  2.414152 1.132743 -3.231319
H  0.491324 0.425194 2.548042
H  -0.746071 -0.80684 2.304192
H  -5.372067 1.921532 -0.500013
H  -5.289505 0.40864 0.401888
H  -3.222386 -1.608847 -2.112136
H  -2.169799 -0.858553 -3.308826
H  5.29568 -1.435473 -0.80658
H  5.202929 -0.382785 0.605043
H  1.173222 -0.235904 -2.117237
H  0.473034 1.365108 -2.331384
H  -5.50274 2.392771 1.89753
H  -4.001744 1.534641 2.220313
H  -3.981726 3.042181 1.289226
H  -0.255662 -2.285664 -2.508528
H  -1.336086 -3.050813 -1.329887
H  -1.620206 -3.257039 -3.058988
H  3.826328 -2.087736 1.810389
H  3.83834 -3.124809 0.372464
H  5.335741 -2.788856 1.239156
H  3.337798 0.569531 -3.099394
H  1.988938 0.856054 -4.196877
H  2.655019 2.195913 -3.267529
elementType: S P O C H
totalener: -2932.91341035 hartree
nucrepener: 2731.90780149 hartree
electener: -5664.82121184 hartree
oneelecener: -9486.90017748 hartree
twoeener: 3822.07896564 hartree
cpcmener: -0.02581450 hartree
kineticenergy: 2925.74170306 hartree
xcener: -173.625657883768 hartree
chargesum: 0.0000000
charge: -0.131015 -0.144216 -0.451504 -0.440345 0.643698 0.632873 -0.365012 -0.334156 -0.346882 -0.343129 -0.115462 0.042431 0.039051 0.038172 0.071043 -0.249985 -0.247742 -0.243219 -0.255958 0.161921 0.163833 0.110208 0.095539 0.095810 0.110926 0.106814 0.094396 0.073645 0.098981 0.103687 0.076995 0.092224 0.091636 0.075525 0.105941 0.075748 0.092292 0.102914 0.085094 0.096123 0.091106
qa: -0.1310 -0.1442 -0.4515 -0.4403 0.6437 0.6329 -0.3650 -0.3342 -0.3469 -0.3431 -0.1155 0.0424 0.0391 0.0382 0.0710 -0.2500 -0.2477 -0.2432 -0.2560 0.1619 0.1638 0.1102 0.0955 0.0958 0.1109 0.1068 0.0944 0.0736 0.0990 0.1037 0.0770 0.0922 0.0916 0.0755 0.1059 0.0757 0.0923 0.1029 0.0851 0.0961 0.0911
va: 2.3083 2.2963 1.9882 2.0247 5.4135 5.4401 2.0977 2.0961 2.0861 2.1032 3.9128 3.8496 3.8304 3.8556 3.8354 3.8928 3.9362 3.8913 3.9702 1.0230 1.0218 0.9915 1.0122 1.0109 0.9966 0.9904 1.0116 1.0059 1.0001 1.0109 1.0173 1.0033 0.9969 1.0139 1.0112 1.0183 1.0032 1.0112 1.0104 1.0061 1.0039
dispcorr: -0.023398157 hartree
energy: -2932.936808511654
dipole: 0.30796 -0.88908 -0.58112 -6.91099 5.92206 -0.98893 -14.10334 12.23392 -1.86942
magnitude: 2.19326 au
magnitude: 5.57483 debye
