program: Orca
programVersion: 5.0.2
elementType: S S S S P P O O O O C C C C C C C C C H H H H H H H H H H H H H H H H H H H H H H
charge: 0
multiplicity: 1
keywords: wb97x-d3
keywords: def2-TZVPP
keywords: def2/J RIJCOSX
keywords: DEFGRID2
keywords: scfconv7
keywords: smallprint printgap noloewdin
keywords: NOSOSCF
formula: C9H22O4P2S4
InChI: InChI=1/C9H22O4P2S4/c1-5-10-14(16,11-6-2)18-9-19-15(17,12-7-3)13-8-4/h5-9H2,1-4H3
41 atoms
S  -1.132271 1.110775 0.324857
S  1.064318 -0.951762 0.925961
S  -2.880504 -1.337365 1.920524
S  3.311484 1.623113 0.803792
P  -2.546741 -0.44159 0.250494
P  2.573002 0.082892 -0.08722
O  -3.774708 0.321263 -0.434535
O  -2.090777 -1.462612 -0.883198
O  3.572468 -1.122324 -0.407793
O  1.904773 0.340755 -1.510319
C  0.045648 0.424315 1.515129
C  -4.862181 0.90286 0.317227
C  -1.351324 -1.134487 -2.081371
C  4.737306 -1.424884 0.389161
C  2.358201 1.372327 -2.417996
C  -4.471514 2.166612 1.041783
C  -2.05823 -0.181775 -3.013598
C  4.393509 -2.152263 1.664538
C  1.363742 2.502639 -2.451889
H  0.683803 1.248871 1.836919
H  -0.491752 0.058931 2.390211
H  -5.629653 1.104502 -0.42749
H  -5.253848 0.158052 1.011894
H  -0.374293 -0.746997 -1.795865
H  -1.197851 -2.096237 -2.567338
H  5.358037 -2.043267 -0.256537
H  5.281722 -0.502146 0.596613
H  3.348087 1.728235 -2.128752
H  2.447906 0.891228 -3.39097
H  -5.36689 2.601893 1.486274
H  -3.762354 1.977735 1.847234
H  -4.043185 2.904389 0.363589
H  -3.053811 -0.534972 -3.280673
H  -2.140094 0.826544 -2.608328
H  -1.472592 -0.11317 -3.93095
H  3.824152 -3.06077 1.468641
H  5.319871 -2.439761 2.162367
H  3.828115 -1.527091 2.3556
H  1.291326 2.998155 -1.483915
H  1.687084 3.241372 -3.185828
H  0.372043 2.153252 -2.741049
elementType: S P O C H
totalener: -2932.91145833 hartree
nucrepener: 2731.43265988 hartree
electener: -5664.34411821 hartree
oneelecener: -9485.72216655 hartree
twoeener: 3821.37804835 hartree
cpcmener: -0.02488604 hartree
kineticenergy: 2925.76500282 hartree
xcener: -173.633697388395 hartree
chargesum: -0.0000000
charge: -0.150275 -0.135124 -0.445575 -0.448773 0.631713 0.643013 -0.343458 -0.348169 -0.360738 -0.329758 -0.108244 0.033576 0.059075 0.043626 0.046053 -0.242885 -0.259194 -0.247809 -0.244681 0.158792 0.167736 0.109092 0.094453 0.060225 0.114802 0.109606 0.093943 0.093418 0.111223 0.103613 0.076538 0.091094 0.104402 0.073189 0.105586 0.092514 0.103224 0.076733 0.075772 0.106742 0.084933
qa: -0.1503 -0.1351 -0.4456 -0.4488 0.6317 0.6430 -0.3435 -0.3482 -0.3607 -0.3298 -0.1082 0.0336 0.0591 0.0436 0.0461 -0.2429 -0.2592 -0.2478 -0.2447 0.1588 0.1677 0.1091 0.0945 0.0602 0.1148 0.1096 0.0939 0.0934 0.1112 0.1036 0.0765 0.0911 0.1044 0.0732 0.1056 0.0925 0.1032 0.0767 0.0758 0.1067 0.0849
va: 2.2868 2.3147 2.0172 1.9939 5.4232 5.4166 2.0848 2.1045 2.1014 2.0988 3.9014 3.8567 3.8462 3.8505 3.8132 3.8859 3.9087 3.8919 3.9372 1.0298 1.0216 0.9912 1.0107 1.0332 0.9945 0.9914 1.0131 1.0151 0.9972 1.0109 1.0180 1.0036 1.0087 1.0123 1.0047 1.0031 1.0110 1.0170 1.0121 1.0115 0.9981
dispcorr: -0.023626761 hartree
energy: -2932.935085088424
dipole: 0.14703 0.46803 0.61506 8.02359 -6.99356 1.03003 -12.21204 10.45069 -1.76135
magnitude: 2.13111 au
magnitude: 5.41684 debye
