program: Orca
programVersion: 5.0.2
elementType: S S S S P P O O O O C C C C C C C C C H H H H H H H H H H H H H H H H H H H H H H
charge: 0
multiplicity: 1
keywords: wb97x-d3
keywords: def2-TZVPP
keywords: def2/J RIJCOSX
keywords: DEFGRID2
keywords: scfconv7
keywords: smallprint printgap noloewdin
keywords: NOSOSCF
formula: C9H22O4P2S4
InChI: InChI=1/C9H22O4P2S4/c1-5-10-14(16,11-6-2)18-9-19-15(17,12-7-3)13-8-4/h5-9H2,1-4H3
41 atoms
S  -0.481579 -1.554871 0.946321
S  0.34726 1.419396 1.092082
S  -3.382612 0.247822 0.896364
S  3.244626 -0.366179 1.141196
P  -2.169575 -0.879355 -0.087906
P  2.080649 0.774867 0.116008
O  -1.510629 -0.270711 -1.403743
O  -2.762711 -2.256621 -0.647989
O  1.502431 0.18614 -1.24885
O  2.675166 2.170302 -0.392047
C  -0.111328 -0.101155 1.964199
C  -2.231528 0.613544 -2.292371
C  -3.846744 -2.967631 -0.016191
C  2.090538 -0.936196 -1.935709
C  3.708385 2.893842 0.309324
C  -1.723378 2.024042 -2.147062
C  -3.419103 -3.694445 1.233179
C  3.34918 -0.554718 -2.67331
C  3.188188 3.627378 1.519216
H  -0.978843 0.15642 2.571288
H  0.694397 -0.406406 2.631214
H  -2.056133 0.229971 -3.296584
H  -3.304616 0.561459 -2.100864
H  -4.659075 -2.270186 0.193707
H  -4.192948 -3.668123 -0.774085
H  2.277821 -1.740262 -1.2223
H  1.317449 -1.273208 -2.624176
H  4.508589 2.203608 0.581461
H  4.10291 3.590584 -0.428125
H  -1.926811 2.417704 -1.152268
H  -0.65097 2.082237 -2.332199
H  -2.224662 2.662293 -2.87504
H  -3.142872 -3.008454 2.033781
H  -4.255076 -4.2970 1.589211
H  -2.581846 -4.365079 1.042309
H  3.701546 -1.415545 -3.242744
H  3.172276 0.260423 -3.3746
H  4.147693 -0.262321 -1.990486
H  2.360817 4.289038 1.263832
H  2.861788 2.94613 2.304903
H  3.992102 4.240788 1.927094
elementType: S P O C H
totalener: -2932.91141044 hartree
nucrepener: 2775.27953285 hartree
electener: -5708.19094329 hartree
oneelecener: -9574.50849972 hartree
twoeener: 3866.31755643 hartree
cpcmener: -0.02372875 hartree
kineticenergy: 2925.79018295 hartree
xcener: -173.637706427728 hartree
chargesum: 0.0000000
charge: -0.138027 -0.136109 -0.453800 -0.446932 0.656871 0.656417 -0.337568 -0.366855 -0.346641 -0.370139 -0.111048 0.046651 0.037620 0.049377 0.041356 -0.251733 -0.247445 -0.242410 -0.249830 0.162447 0.164877 0.109154 0.091660 0.094983 0.109774 0.090647 0.103775 0.093375 0.110811 0.077365 0.082473 0.106631 0.076191 0.103375 0.091480 0.098166 0.091348 0.078333 0.091818 0.077917 0.103647
qa: -0.1380 -0.1361 -0.4538 -0.4469 0.6569 0.6564 -0.3376 -0.3669 -0.3466 -0.3701 -0.1110 0.0467 0.0376 0.0494 0.0414 -0.2517 -0.2474 -0.2424 -0.2498 0.1624 0.1649 0.1092 0.0917 0.0950 0.1098 0.0906 0.1038 0.0934 0.1108 0.0774 0.0825 0.1066 0.0762 0.1034 0.0915 0.0982 0.0913 0.0783 0.0918 0.0779 0.1036
va: 2.3005 2.3042 1.9840 1.9953 5.4027 5.3870 2.0933 2.0967 2.0821 2.0845 3.9000 3.8287 3.8597 3.8266 3.8556 3.9326 3.8920 3.9388 3.8993 1.0192 1.0191 0.9963 1.0126 1.0120 0.9916 1.0144 0.9935 1.0118 0.9907 1.0110 1.0133 1.0116 1.0173 1.0107 1.0039 1.0074 1.0059 1.0174 1.0037 1.0170 1.0105
dispcorr: -0.023700323 hartree
energy: -2932.935110762337
dipole: 2.94465 -2.97874 -0.03409 2.86479 -2.94557 -0.08078 -9.61325 8.65508 -0.95817
magnitude: 0.96217 au
magnitude: 2.44565 debye
