program: Orca
programVersion: 5.0.2
elementType: S S S S P P O O O O C C C C C C C C C H H H H H H H H H H H H H H H H H H H H H H
charge: 0
multiplicity: 1
keywords: wb97x-d3
keywords: def2-TZVPP
keywords: def2/J RIJCOSX
keywords: DEFGRID2
keywords: scfconv7
keywords: smallprint printgap noloewdin
keywords: NOSOSCF
formula: C9H22O4P2S4
InChI: InChI=1/C9H22O4P2S4/c1-5-10-14(16,11-6-2)18-9-19-15(17,12-7-3)13-8-4/h5-9H2,1-4H3
41 atoms
S  -1.046232 1.626254 0.579628
S  1.900711 1.323101 1.260732
S  -2.437338 -1.36013 1.505433
S  1.686255 -1.987813 0.470318
P  -2.118272 -0.097417 0.086432
P  2.256542 -0.243072 -0.09239
O  -3.404418 0.575362 -0.591703
O  -1.332885 -0.636068 -1.193093
O  1.603986 0.165621 -1.484652
O  3.818598 -0.002868 -0.338508
C  0.193018 0.993027 1.753567
C  -4.644651 0.771043 0.121422
C  -1.432625 -2.008686 -1.630366
C  1.84608 1.417389 -2.162086
C  4.84253 -0.768179 0.335182
C  -4.585302 1.918048 1.09908
C  -2.792503 -2.34215 -2.192991
C  0.703834 1.665727 -3.11222
C  4.991914 -0.394265 1.788565
H  0.053545 1.519852 2.697028
H  0.042004 -0.071285 1.947826
H  -5.380802 0.962222 -0.656964
H  -4.920799 -0.158009 0.623566
H  -0.658517 -2.108516 -2.388547
H  -1.17433 -2.666636 -0.799821
H  1.923224 2.227977 -1.434142
H  2.794659 1.34501 -2.695138
H  4.623864 -1.831805 0.224453
H  5.754267 -0.552954 -0.218579
H  -4.278967 2.844935 0.614293
H  -5.581308 2.071622 1.515438
H  -3.908855 1.717494 1.929768
H  -2.764926 -3.352829 -2.601063
H  -3.569639 -2.321177 -1.427982
H  -3.074709 -1.663881 -2.99788
H  -0.238069 1.795488 -2.580463
H  0.902096 2.579972 -3.671275
H  0.593532 0.85322 -3.830767
H  4.110762 -0.658831 2.373029
H  5.837579 -0.94355 2.202854
H  5.18999 0.669828 1.914494
elementType: S P O C H
totalener: -2932.91130738 hartree
nucrepener: 2778.68724379 hartree
electener: -5711.59855116 hartree
oneelecener: -9581.56801315 hartree
twoeener: 3869.96946199 hartree
cpcmener: -0.02539846 hartree
kineticenergy: 2925.77214712 hartree
xcener: -173.633607373696 hartree
chargesum: 0.0000000
charge: -0.140939 -0.146229 -0.439866 -0.430757 0.646171 0.646383 -0.368743 -0.343754 -0.332881 -0.360510 -0.071166 0.047195 0.043272 0.000973 0.035584 -0.250091 -0.243863 -0.240061 -0.247627 0.173502 0.115883 0.111582 0.093733 0.103626 0.090273 0.106304 0.114766 0.095745 0.109557 0.091573 0.103468 0.077382 0.099479 0.077950 0.092247 0.073108 0.100251 0.094381 0.075998 0.103560 0.092541
qa: -0.1409 -0.1462 -0.4399 -0.4308 0.6462 0.6464 -0.3687 -0.3438 -0.3329 -0.3605 -0.0712 0.0472 0.0433 0.0010 0.0356 -0.2501 -0.2439 -0.2401 -0.2476 0.1735 0.1159 0.1116 0.0937 0.1036 0.0903 0.1063 0.1148 0.0957 0.1096 0.0916 0.1035 0.0774 0.0995 0.0779 0.0922 0.0731 0.1003 0.0944 0.0760 0.1036 0.0925
va: 2.3013 2.2962 2.0022 2.0236 5.4051 5.4200 2.0797 2.0888 2.1004 2.1003 3.8984 3.8393 3.8242 3.8540 3.8580 3.9093 3.9414 3.9254 3.8847 0.9919 1.0669 0.9906 1.0128 0.9943 1.0134 1.0007 0.9986 1.0110 0.9908 1.0040 1.0109 1.0151 1.0076 1.0167 1.0064 1.0206 1.0096 1.0031 1.0189 1.0110 1.0029
dispcorr: -0.024840627 hartree
energy: -2932.936148002388
dipole: -3.81996 4.22672 0.40676 2.64991 -1.21439 1.43551 -9.19108 8.50718 -0.68390
magnitude: 1.64130 au
magnitude: 4.17186 debye
