program: Orca
programVersion: 5.0.2
elementType: S S S S P P O O O O C C C C C C C C C H H H H H H H H H H H H H H H H H H H H H H
charge: 0
multiplicity: 1
keywords: wb97x-d3
keywords: def2-TZVPP
keywords: def2/J RIJCOSX
keywords: DEFGRID2
keywords: scfconv7
keywords: smallprint printgap noloewdin
keywords: NOSOSCF
formula: C9H22O4P2S4
InChI: InChI=1/C9H22O4P2S4/c1-5-10-14(16,11-6-2)18-9-19-15(17,12-7-3)13-8-4/h5-9H2,1-4H3
41 atoms
S  -0.709129 -1.309271 1.381576
S  0.32397 1.582232 1.010697
S  -3.711044 0.323818 1.434267
S  3.070325 -0.431141 1.113476
P  -2.445788 -0.680321 0.393392
P  1.915958 0.656921 0.023253
O  -1.865452 0.045319 -0.90421
O  -3.027022 -2.080032 -0.104735
O  1.187302 -0.069112 -1.196682
O  2.577354 1.918148 -0.708027
C  -0.178098 0.251171 2.134069
C  -2.459765 1.208672 -1.511815
C  -2.342296 -2.958508 -1.032826
C  1.770451 -1.196265 -1.882539
C  3.714516 2.629493 -0.173785
C  -1.545919 1.675659 -2.615349
C  -1.949922 -4.242036 -0.347638
C  2.981843 -0.815318 -2.697128
C  3.378974 3.453864 1.043843
H  -0.980574 0.661875 2.747659
H  0.651252 -0.009177 2.79154
H  -3.444786 0.950272 -1.903559
H  -2.587124 1.985165 -0.756721
H  -3.048924 -3.148039 -1.839702
H  -1.470724 -2.466363 -1.468798
H  2.011027 -1.973277 -1.154855
H  0.97106 -1.569104 -2.520595
H  4.512064 1.917011 0.043166
H  4.045405 3.265001 -0.992896
H  -0.575151 1.987422 -2.231133
H  -1.394127 0.901418 -3.367602
H  -2.002008 2.533797 -3.10859
H  -1.529154 -4.920494 -1.090247
H  -1.193574 -4.084774 0.421832
H  -2.810516 -4.734667 0.104351
H  3.308836 -1.68355 -3.269849
H  2.755369 -0.015549 -3.401699
H  3.817593 -0.504755 -2.069243
H  3.119189 2.83447 1.902174
H  4.255506 4.042367 1.316384
H  2.559522 4.145687 0.850069
elementType: S P O C H
totalener: -2932.91061575 hartree
nucrepener: 2792.09598841 hartree
electener: -5725.00660416 hartree
oneelecener: -9607.27132291 hartree
twoeener: 3882.26471875 hartree
cpcmener: -0.02788402 hartree
kineticenergy: 2925.77314541 hartree
xcener: -173.633623539729 hartree
chargesum: -0.0000000
charge: -0.153932 -0.136503 -0.441579 -0.443496 0.629309 0.650639 -0.325515 -0.359804 -0.341081 -0.369514 -0.109028 0.028863 0.026419 0.035725 0.043999 -0.249141 -0.227793 -0.242039 -0.251883 0.164249 0.162097 0.122055 0.097073 0.112282 0.090952 0.097244 0.107052 0.094409 0.111782 0.070821 0.094063 0.100766 0.096122 0.077743 0.091924 0.100089 0.092462 0.079087 0.077126 0.104240 0.092715
qa: -0.1539 -0.1365 -0.4416 -0.4435 0.6293 0.6506 -0.3255 -0.3598 -0.3411 -0.3695 -0.1090 0.0289 0.0264 0.0357 0.0440 -0.2491 -0.2278 -0.2420 -0.2519 0.1642 0.1621 0.1221 0.0971 0.1123 0.0910 0.0972 0.1071 0.0944 0.1118 0.0708 0.0941 0.1008 0.0961 0.0777 0.0919 0.1001 0.0925 0.0791 0.0771 0.1042 0.0927
va: 2.2994 2.3010 2.0152 2.0046 5.4599 5.3823 2.0518 2.0989 2.0841 2.0694 3.9253 3.8159 3.8761 3.8258 3.8440 3.9535 3.9336 3.9306 3.9038 1.0162 1.0176 0.9969 1.0057 0.9984 0.9954 1.0137 0.9876 1.0101 0.9904 1.0181 1.0018 1.0095 1.0077 1.0083 1.0041 1.0079 1.0055 1.0169 1.0174 1.0108 1.0033
dispcorr: -0.024475036 hartree
energy: -2932.935090780987
dipole: 11.55142 -10.08150 1.46992 0.03245 0.03058 0.06303 -19.38147 17.14158 -2.23989
magnitude: 2.67988 au
magnitude: 6.81172 debye
